{"text_format":"1","workbook":"xlsx","n_sheets":5,"sheets":["Início","Historical","Downloader","Mercados","Função Excel"],"not_rendered":{"charts":0,"images":10,"macros":1,"external_links":0,"defined_names":13,"comments":0,"pivot_tables":0},"unopened":[],"bounds":{"document_bytes":16777216,"sheet_cells":100000,"rows_first":2000,"rows_last":500,"rows_between":2000,"halvings":0,"cell_chars":16384,"cell_head_chars":4096},"cells_cut":0,"cells_raw":0,"read":"whole","date_system":"1900"}

{"sheet":"Início","index":0,"n_rows":7,"n_cols":8,"rows_kept":7,"cut":false,"hidden":false,"merged":[]}
[]
[]
[]
[]
[]
[null,null,null,null,null,null,null,"1. APERTE NO BOTÃO HABILITAR EDIÇÃO"]
[null,null,null,null,null,null,null,"2. APERTE NO BOTÃO HABILITAR CONTEÚDO"]

{"sheet":"Historical","index":1,"n_rows":2148,"n_cols":28,"rows_kept":2148,"cut":false,"hidden":true,"merged":[]}
[null,null,null,null,null,null,null,null,null,{"$f":"COUNTA(K:K)+1","v":21},null,null,{"$f":"COUNTA(N:N)+1","v":347},null,{"$f":"COUNTA(P:P)+1","v":113},null,{"$f":"COUNTA(R:R)+1","v":29},null,null,{"$f":"COUNTA(U:U)+1","v":1459},null,{"$f":"COUNTA(W:W)+1","v":39},null,{"$f":"COUNTA(Y:Y)+1","v":152},null,{"$f":"COUNTA(AA:AA)+1","v":2148}]
[null,null,null,null,null,{"$f":"IFERROR(IF(Market=\"Moedas\",LEFT(Ticker,3)&\"/\"&RIGHT(Ticker,3),INDEX(Z:Z,MATCH(Ticker,AA:AA,0))),\"\")","v":"Petroleo Brasileiro SA Petrobras"},null,{"$f":"VLOOKUP(Historical!$C$7,Historical!$G$3:$H$7,2,FALSE)","v":"Valores diários"},null,"Índices BOVESPA","Código","Auxiliar","Ações BOVESPA","Código","Cryptomoedas","Código","Commodities","Código","Auxiliar","Fundos","Código","Moedas","Código","Top 150 do Mundo","Código","Ativo","Código","Tipo"]
[null,"Market:","BOVESPA - Sao Paulo Stock Exchange",{"$f":"VLOOKUP(C3,Mercados!$C:$D,2,FALSE)","v":".SA"},null,"Diário","Daily Prices","Valores diários",null,"I DIVIDENDOS","IDIV","IDIV.SA","AES Elpa SA","AELP3","0x","ZRX","Brent Crude Oil Last Day Financ","BZ","BZ%3DF","13D Activist A","DDDAX","AUD/JPY","AUDJPY","Abbott Laboratories","ABT","I DIVIDENDOS","IDIV","BOVESPA - ÍNDICES"]
[null,"Stock Symbol:",{"$f":"IF(Market=\"BOVESPA - ÍNDICES\",VLOOKUP(Ticker,$K:$L,2,FALSE),IF(Market=\"Commodities\",VLOOKUP(Ticker,$R:$S,2,FALSE),Ticker&IF(D3=\"N/A\",\"\",D3)))","v":"PETR4.SA"},"PETR4",null,"Semanal","Weekly Prices","Valores semanais",null,"IBOVESPA","IBOV","%5EBVSP","AES Tiete Energia SA","TIET11","AdEx","ADX","Cocoa Futures","CC","CC%3DF","13D Activist I","DDDIX","AUD/USD","AUDUSD","AbbVie Inc.","ABBV","IBOVESPA","IBOV","BOVESPA - ÍNDICES"]
[null,"End Date:",null,{"$f":"TODAY()-1","v":"2019-01-23"},null,"Mensal","Monthly Prices","Valores mensais",null,"IBRASIL","IBRA","IBRA.SA","AES Tiete Energia SA","TIET3","Aeternity","AE","Coffee 'C' Futures","KC","KC%3DF","AB Concentrated Growth I","WPSIX","BRL/ARS","BRLARS","Advanced Micro Devices, Inc.","AMD","IBRASIL","IBRA","BOVESPA - ÍNDICES"]
[null,"Start Date:",null,{"$f":"DATE(YEAR(D5),MONTH(D5)-6,1)","v":"2018-07-01"},null,"Dividendos","Dividends","Dividendos",null,"IBRX 50","IBXL","%5EIBX50","AES Tiete Energia SA","TIET4","Aragon","ANT","Copper","HG","HG%3DF","AB Core Opportunities K","ADGKX","BRL/AUD","BRLAUD","Alibaba Group Holding Limited","BABA","IBRX 50","IBXL","BOVESPA - ÍNDICES"]
[null,"Data Type:",{"$f":"VLOOKUP(Type,$F$3:$G$9,2,FALSE)","v":"Daily Prices"},"Diário",null,"Splits","Splits","Splits",null,"IBRX BRASIL","IBXX","IBXX.SA","Alfa Holdings SA","RPAD6","Ardor","ARDR","Corn Futures","C","C%3DF","AB Discovery Value A","ABASX","BRL/CAD","BRLCAD","Altaba Inc.","AABA","IBRX BRASIL","IBXX","BOVESPA - ÍNDICES"]
[null,"Date Order:",{"$f":"VLOOKUP(Order,$F$3:$G$9,2,FALSE)","v":"Ascending"},"Ascendente",null,"Ascendente","Ascending",null,null,"ICO2","ICO2","ICO2.SA","Aliansce Shopping Centers SA","ALSC3","ARK","ARK","Cotton No. 2 Futures","CT","CT%3DF","AB Discovery Value Advisor","ABYSX","BRL/CNY","BRLCNY","Altice USA, Inc.","ATUS","ICO2","ICO2","BOVESPA - ÍNDICES"]
[null,"Output Type:","Table",null,null,"Descendente","Descending",null,null,"ICONSUMO","ICON","ICON.SA","Alpargatas SA","ALPA3","ATB coin","ATB","Frozen Concentrated OJ (FCOJ-A)","OJ","OJ%3DF","AB Discovery Value I","ABSIX","BRL/EUR","BRLEUR","Altria Group, Inc.","MO","ICONSUMO","ICON","BOVESPA - ÍNDICES"]
[null,{"$f":"\"https://br.financas.yahoo.com/quote/\"&StockSymbol&\"/history?p=\"&StockSymbol","v":"https://br.financas.yahoo.com/quote/PETR4.SA/history?p=PETR4.SA"},null,null,null,"Relação Moedas",false,null,null,"IFINANCEIRO","IFNC","IFNC.SA","Alpargatas SA","ALPA4","Augur","REP","future for FC","FC","FC%3DF","AB Discovery Value K","ABSKX","BRL/GBP","BRLGBP","Ambev S.A.","ABEV","IFINANCEIRO","IFNC","BOVESPA - ÍNDICES"]
[null,"http://www.signalsolver.com/download-historical-stock-price-data-excel/",null,null,null,"Mercados",{"$f":"\"Mercados!C7:C\"&COUNTA(Mercados!B:B)+5","v":"Mercados!C7:C71"},null,null,"IGC - NM","IGNM","IGCNM.SA","Alupar Investimento SA","ALUP11","Autumncoin","ATM","future for KW","KW","KW%3DF","AB Discovery Value Z","ABSZX","BRL/INR","BRLINR","American Airlines Group Inc.","AAL","IGC - NM","IGNM","BOVESPA - ÍNDICES"]
[null,null,null,null,null,"Dados","Historical!F3:F7",null,null,"IGC TRADE","IGCT","IGCT.SA","Ambev SA","ABEV3","Bancor Network Token","BNT","future for LB","LB","LB%3DF","AB Large Cap Growth Advisor","APGYX","BRL/JPY","BRLJPY","Annaly Capital Management, Inc.","NLY","IGC TRADE","IGCT","BOVESPA - ÍNDICES"]
[null,null,null,null,null,"Ordem","Historical!F8:F9",null,null,"IGOVERNANCA","IGCX","%5EIGCX","Ampla Energia e Servicos SA","CBEE3","Basic Attention Token","BAT","future for LC","LC","LC%3DF","AB Large Cap Growth B","APGBX","BRL/SEK","BRLSEK","Apple Inc.","AAPL","IGOVERNANCA","IGCX","BOVESPA - ÍNDICES"]
[null,null,null,null,null,"Tipo","Historical!F17:F24",null,null,"IMAT BASICOS","IMAT","IMAT.SA","Anima Holding SA","ANIM3","Binance Coin","BNB","future for LH","LH","LH%3DF","AB Large Cap Growth C","APGCX","BRL/USD","BRLUSD","Applied Materials, Inc.","AMAT","IMAT BASICOS","IMAT","BOVESPA - ÍNDICES"]
[null,null,null,null,null,"Listas",{"$f":"VLOOKUP(H15,F17:G24,2,FALSE)","v":"Historical!$M$3:$N$347"},"Ações BOVESPA",null,"IMOBILIARIO","IMOB","IMOB.SA","Arezzo Industria E Comercio SA","ARZZ3","Bitcoin","BTC","Henry Hub Natural Gas Future","NG","NG%3DF","AB Large Cap Growth K","ALCKX","EUR/CAD","EURCAD","AT&T Inc.","T","IMOBILIARIO","IMOB","BOVESPA - ÍNDICES"]
[null,null,null,null,null,null,{"$f":"INDIRECT(ADDRESS(1,MATCH(IF(H15=\"Todos\",\"Ativo\",H15),$2:$2,0)))","v":347},{"$f":"VLOOKUP(H15,F17:H24,3,FALSE)","v":"BOVESPA - Sao Paulo Stock Exchange"},null,"IND FDO IMOB","IFIX","IFIX.SA","Atacadao SA","CRFB3","Bitcoin Cash / BCC","BCH","Mont Belvieu LDH Propane (OPIS)","B0","B0%3DF","AB Large Cap Growth Z","APGZX","EUR/CHF","EURCHF","Banco Bradesco S.A.","BBD","IND FDO IMOB","IFIX","BOVESPA - ÍNDICES"]
[null,null,null,null,null,"Ações BOVESPA",{"$f":"\"Historical!\"&ADDRESS(3,MATCH(F17,$2:$2,0))&\":\"&ADDRESS(INDIRECT(ADDRESS(1,MATCH(F17,$2:$2,0))),MATCH(F17,$2:$2,0)+1)","v":"Historical!$M$3:$N$347"},"BOVESPA - Sao Paulo Stock Exchange","","ISUSTENTABIL","ISEE","ISEE.SA","ATOM Empreendimentos e Participacoes SA","ATOM3","Bitcoin Gold","BTG","NY Harbor ULSD Futures","HO","HO%3DF","AB Select US Equity C","AUUCX","EUR/GBP","EURGBP","Banco Santander, S.A.","SAN","ISUSTENTABIL","ISEE","BOVESPA - ÍNDICES"]
[null,null,null,null,null,"Índices BOVESPA","Historical!$J$3:$K$21","BOVESPA - ÍNDICES","","IVBX2","IVBX","%5EIVBX2","Azevedo & Travassos SA","AZEV4","BitcoinDark","BTCD","Oats","O","O%3DF","AB Small Cap Growth Advisor","QUAYX","EUR/HUF","EURHUF","Bank of America Corporation","BAC","IVBX2","IVBX","BOVESPA - ÍNDICES"]
[null,null,null,null,null,"Cryptomoedas","Historical!$O$3:$P$113","Cryptocurrencies","","MIDLARGE CAP","MLCX","MLCX.SA","Azul SA","AZUL4","BitConnect Coin","BCCOIN","Ouro","GC","GC%3DF","AB Sustainable Global Thematic R","ATERX","EUR/JPY","EURJPY","Barrick Gold Corporation","ABX","MIDLARGE CAP","MLCX","BOVESPA - ÍNDICES"]
[null,null,null,null,null,"Commodities","Historical!$Q$3:$R$29","Commodities",null,"SMALL CAP","SMLL","SMLL.SA","B2W Companhia Digital","BTOW3","Bitquence","BQX","Palladium Futures","PA","PA%3DF","Aberdeen Global Infrastructure A","AIAFX","EUR/JPY","EURJPY","Bed Bath & Beyond Inc.","BBBY","SMALL CAP","SMLL","BOVESPA - ÍNDICES"]
[null,null,null,null,null,"Fundos","Historical!$T$3:$U$1459","Fundos",null,"UTILITIES","UTIL","UTIL.SA","B3 SA Brasil Bolsa Balcao","B3SA3","Bitshares","BTS","Petróleo Crú","CL","CL%3DF","Aberdeen Realty Income & Growth A","AIAGX","EUR/SEK","EURSEK","Bilibili Inc.","BILI","UTILITIES","UTIL","BOVESPA - ÍNDICES"]
[null,null,null,null,null,"Moedas","Historical!$V$3:$W$39","Moedas",null,null,null,null,"Bahema SA","BAHI3","BlockNet","BLOCK","Platinum Futures","PL","PL%3DF","Aberdeen US Small Cap Equity Inst Svc","GSXIX","EUR/USD","EURUSD","Boston Scientific Corporation","BSX","AES Elpa SA","AELP3","BOVESPA - Sao Paulo Stock Exchange"]
[null,null,null,null,null,"Top 150 do Mundo","Historical!$X$3:$Y$152","Top 150 do Mundo",null,null,null,null,"Banco ABC Brasil SA","ABCB4","Byteball","GBYTE","RBOB Gasoline Futures","RB","RB%3DF","AC Alternatives Discp Long Short C","ACDHX","GBP/JPY","GBPJPY","Bristol-Myers Squibb Company","BMY","AES Tiete Energia SA","TIET11","BOVESPA - Sao Paulo Stock Exchange"]
[null,null,null,null,null,"Todos",{"$f":"\"Historical!\"&ADDRESS(3,MATCH(\"Ativo\",$2:$2,0))&\":\"&ADDRESS(INDIRECT(ADDRESS(1,MATCH(\"Ativo\",$2:$2,0))),MATCH(\"Ativo\",$2:$2,0)+1)","v":"Historical!$Z$3:$AA$2148"},{"$f":"IFERROR(VLOOKUP(Ticker,AA:AB,2,FALSE),\"---\")","v":"BOVESPA - Sao Paulo Stock Exchange"},null,null,null,null,"Banco Alfa de Investimento SA","BRIV3","ByteCoin","BCN","Rough Rice","RR","RR%3DF","Acadian Emerging Markets I","AEMZX","GBP/USD","GBPUSD","Caesars Entertainment Corporation","CZR","AES Tiete Energia SA","TIET3","BOVESPA - Sao Paulo Stock Exchange"]
[null,null,null,null,null,null,null,null,null,null,null,null,"Banco Alfa de Investimento SA","BRIV4","Cardano","ADA","Silver ","SI","SI%3DF","Adirondack Small Cap","ADKSX","NZD/USD","NZDUSD","Callon Petroleum Company","CPE","AES Tiete Energia SA","TIET4","BOVESPA - Sao Paulo Stock Exchange"]
[null,null,null,null,null,null,null,null,null,null,null,null,"Banco Bradesco SA","BBDC4","ChainLink","LINK","Soybean Meal","SM","SM%3DF","AdvisorOne CLS Global Aggressive Eq N","CLACX","USD/CAD","USDCAD","Canadian Natural Resources Limited","CNQ","Alfa Holdings SA","RPAD6","BOVESPA - Sao Paulo Stock Exchange"]
[null,null,null,null,null,null,null,null,null,null,null,null,"Banco Bradesco SA","BBDC3","Civic","CVC","Soybean Oil Futures","BO","BO%3DF","AIG Focused Alpha Large-Cap W","SFLWX","USD/CHF","USDCHF","Celgene Corporation","CELG","Aliansce Shopping Centers SA","ALSC3","BOVESPA - Sao Paulo Stock Exchange"]
[null,null,null,null,null,null,null,null,null,null,null,null,"Banco BTG Pactual SA","BPAC5","CounterParty","XCP","Soybeans","S","S%3DF","AIG Focused Dividend Strategy A","FDSAX","USD/CNY","USDCNY","CEMEX, S.A.B. de C.V.","CX","Alpargatas SA","ALPA3","BOVESPA - Sao Paulo Stock Exchange"]
[null,null,null,null,null,null,null,null,null,null,null,null,"Banco da Amazonia SA","BAZA3","Decred","DCR","Sugar No. 11 (World) Futures","SB","SB%3DF","AIG Focused Multi-Cap Growth C","FOCCX","USD/HKD","USDHKD","CEMEX, S.A.B. de C.V.","CXMSF","Alpargatas SA","ALPA4","BOVESPA - Sao Paulo Stock Exchange"]
[null,null,null,null,null,null,null,null,null,null,null,null,"Banco do Brasil SA","BBAS3","Dentacoin","DCN",null,null,null,"AIG Focused Multi-Cap Growth W","FOCWX","USD/IDR","USDIDR","Chesapeake Energy Corporation","CHK","Alupar Investimento SA","ALUP11","BOVESPA - Sao Paulo Stock Exchange"]
[null,null,null,null,null,null,null,null,null,null,null,null,"Banco do Estado de Sergipe SA","BGIP4","DigiByte","DGB",null,null,null,"AIG Small-Cap W","SASWX","USD/INR","USDINR","Chevron Corporation","CVX","Ambev SA","ABEV3","BOVESPA - Sao Paulo Stock Exchange"]
[null,null,null,null,null,null,null,null,null,null,null,null,"Banco do Estado do Rio Grande do Sul SA","BRSR6","DigitalCash","DASH",null,null,null,"Akre Focus Instl","AKRIX","USD/JPY","USDJPY","Cisco Systems, Inc.","CSCO","Ampla Energia e Servicos SA","CBEE3","BOVESPA - Sao Paulo Stock Exchange"]
[null,null,null,null,null,null,null,null,null,null,null,null,"Banco do Estado do Rio Grande do Sul SA","BRSR3","Digix DAO","DGD",null,null,null,"Akre Focus Retail","AKREX","USD/MXN","USDMXN","Citigroup Inc.","C","Anima Holding SA","ANIM3","BOVESPA - Sao Paulo Stock Exchange"]
[null,null,null,null,null,null,null,null,null,null,null,null,"Banco Indusval SA","IDVL4","district0x","DNT",null,null,null,"Akre Focus Supra Institutional","AKRSX","USD/MYR","USDMYR","Citizens Financial Group, Inc.","CFG","Arezzo Industria E Comercio SA","ARZZ3","BOVESPA - Sao Paulo Stock Exchange"]
[null,null,null,null,null,null,null,null,null,null,null,null,"Banco Mercantil de Investimentos SA","BMIN4","Dogecoin","DOGE",null,null,null,"Alger Balanced I-2","ABLOX","USD/PHP","USDPHP","Cleveland-Cliffs Inc.","CLF","Atacadao SA","CRFB3","BOVESPA - Sao Paulo Stock Exchange"]
[null,null,null,null,null,null,null,null,null,null,null,null,"Banco Mercantil do Brasil SA","BMEB3","Edgeless","EDG",null,null,null,"Alger Capital Appreciation Focus A","ALAFX","USD/RUB","USDRUB","Colony NorthStar, Inc.","CLNS","ATOM Empreendimentos e Participacoes SA","ATOM3","BOVESPA - Sao Paulo Stock Exchange"]
[null,null,null,null,null,null,null,null,null,null,null,null,"Banco Mercantil do Brasil SA","BMEB4","EOS","EOS",null,null,null,"Alger Capital Appreciation Focus C","ALCFX","USD/SGD","USDSGD","Comcast Corporation","CMCSA","Azevedo & Travassos SA","AZEV4","BOVESPA - Sao Paulo Stock Exchange"]
[null,null,null,null,null,null,null,null,null,null,null,null,"Banco Pan SA","BPAN4","Ethereum","ETH",null,null,null,"Alger Capital Appreciation Focus I","ALGRX","USD/THB","USDTHB","Conagra Brands, Inc.","CAG","Azul SA","AZUL4","BOVESPA - Sao Paulo Stock Exchange"]
[null,null,null,null,null,null,null,null,null,null,null,null,"Banco Pine SA","PINE4","Ethereum Classic","ETC",null,null,null,"Alger Capital Appreciation Focus Z","ALZFX","USD/ZAR","USDZAR","ConocoPhillips","COP","B2W Companhia Digital","BTOW3","BOVESPA - Sao Paulo Stock Exchange"]
[null,null,null,null,null,null,null,null,null,null,null,null,"Banco Santander Brasil SA","SANB3","Exchange Union","XUC",null,null,null,"Alger Small Cap Focus Z","AGOZX",null,null,"Constellation Brands, Inc.","STZ","B3 SA Brasil Bolsa Balcao","B3SA3","BOVESPA - Sao Paulo Stock Exchange"]
{"$rows_left_out":2109}
{"sheet":"Downloader","index":2,"n_rows":29,"n_cols":8,"rows_kept":29,"cut":false,"hidden":false,"merged":[[6,6,7,7],[6,1,6,2],[7,1,7,2]]}
[]
[]
[]
[]
[null,"*Preço de fechamento ajustado para desdobramento.",null,null,null,null,null,"**Preço de fechamento ajustado para dividendos e desdobramentos."]
[]
[null,"PETR4",null,"De","2018-12-25",null,"Valores diários"]
[null,"Petroleo Brasileiro SA Petrobras",null,"Até","2019-01-24"]
[]
[null,"Data","Abertura","Máxima","Mínima","Fechamento*","Volume","Ajuste**"]
[null,"2018-12-26",20.59,21.68,20.420000000000002,21.68,77104200,21.68]
[null,"2018-12-27",21.52,21.98,21.280000999999999,21.67,74083700,21.67]
[null,"2018-12-28",22.110001,22.83,22.08,22.68,61634700,22.68]
[null,"2019-01-02",22.549999,24.200001,22.280000999999999,24.059999000000001,104534800,24.059999000000001]
[null,"2019-01-03",23.959999,24.82,23.799999,24.65,95206400,24.65]
[null,"2019-01-04",24.85,24.940000999999999,24.469999000000001,24.719999000000001,72119800,24.719999000000001]
[null,"2019-01-07",24.85,25.92,24.700001,25.110001,121711900,25.110001]
[null,"2019-01-08",25.4,25.42,24.77,24.959999,68761800,24.959999]
[null,"2019-01-09",25.299999,25.5,25.15,25.48,70177600,25.48]
[null,"2019-01-10",25.26,25.41,25.07,25.26,54763700,25.26]
[null,"2019-01-11",25.15,25.190000999999999,24.84,24.99,53980700,24.99]
[null,"2019-01-14",24.82,25.09,24.66,24.85,46577300,24.85]
[null,"2019-01-15",24.83,25.120000999999998,24.700001,24.83,53731500,24.83]
[null,"2019-01-16",24.799999,24.9,24.66,24.82,40425000,24.82]
[null,"2019-01-17",24.75,25.299999,24.68,25.16,50359400,25.16]
[null,"2019-01-18",25.440000999999999,25.559999000000001,25.280000999999999,25.4,67021300,25.4]
[null,"2019-01-21",25.309999000000001,25.530000999999999,25.1,25.530000999999999,45336500,25.530000999999999]
[null,"2019-01-22",25.26,25.5,25.02,25.129999000000002,61307000,25.129999000000002]
[null,"2019-01-23",25.33,25.540001,25.16,25.43,52922300,25.43]

{"sheet":"Mercados","index":3,"n_rows":71,"n_cols":6,"rows_kept":71,"cut":false,"hidden":false,"merged":[]}
[]
[]
[]
[]
[]
[null,"País","Mercado","Sufixo","Delay","Base de dados"]
[null,"Argentina","Buenos Aires Stock Exchange",".BA","30 min","Interactive Data Real-Time Services"]
[null,"Australia","Australian Stock Exchange",".AX","20 min","Interactive Data Real-Time Services"]
[null,"Austria","Vienna Stock Exchange",".VI","15 min","Telekurs"]
[null,"Brazil","BOVESPA - Sao Paulo Stock Exchange",".SA","15 min","Interactive Data Real-Time Services"]
[null,"Brazil","BOVESPA - ÍNDICES","N/A","15 min","Interactive Data Real-Time Services"]
[null,"Canada","Toronto Stock Exchange",".TO","15 min","Interactive Data Real-Time Services"]
[null,"Canada","TSX Venture Exchange",".V","15 min","Interactive Data Real-Time Services"]
[null,"Chile","Santiago Stock Exchange",".SN","15 min","Interactive Data Real-Time Services"]
[null,"China","Shanghai Stock Exchange",".SS","30 min","Interactive Data Real-Time Services"]
[null,"China","Shenzhen Stock Exchange",".SZ","30 min","Interactive Data Real-Time Services"]
[null,"Denmark","Copenhagen Stock Exchange",".CO","15 min","Telekurs"]
[null,"France","Euronext",".NX","15 min","Telekurs"]
[null,"France","Paris Stock Exchange",".PA","15 min","Telekurs"]
[null,"Germany","Berlin Stock Exchange",".BE","15 min","Telekurs"]
[null,"Germany","Bremen Stock Exchange",".BM","15 min","Telekurs"]
[null,"Germany","Dusseldorf Stock Exchange",".DU","15 min","Telekurs"]
[null,"Germany","Frankfurt Stock Exchange",".F","15 min","Telekurs"]
[null,"Germany","Hamburg Stock Exchange",".HM","15 min","Telekurs"]
[null,"Germany","Hanover Stock Exchange",".HA","15 min","Telekurs"]
[null,"Germany","Munich Stock Exchange",".MU","15 min","Telekurs"]
[null,"Germany","Stuttgart Stock Exchange",".SG","15 min","Telekurs"]
[null,"Germany","XETRA Stock Exchange",".DE","15 min","Telekurs"]
[null,"Hong Kong","Hong Kong Stock Exchange",".HK","15 min","Interactive Data Real-Time Services"]
[null,"India","Bombay Stock Exchange",".BO","15 min","Interactive Data Real-Time Services"]
[null,"India","National Stock Exchange of India",".NS","15 min","National Stock Exchange of India"]
[null,"Indonesia","Jakarta Stock Exchange",".JK","10 min","Interactive Data Real-Time Services"]
[null,"Israel","Tel Aviv Stock Exchange",".TA","20 min","Telekurs"]
[null,"Italy","Milan Stock Exchange",".MI","20 min","Telekurs"]
[null,"Japan","Nikkei Indices","N/A","30 min","Interactive Data Real-Time Services"]
[null,"Mexico","Mexico Stock Exchange",".MX","20 min","Telekurs"]
[null,"Netherlands","Amsterdam Stock Exchange",".AS","15 min","Telekurs"]
[null,"New Zealand","New Zealand Stock Exchange",".NZ","20 min","Interactive Data Real-Time Services"]
[null,"Norway","Oslo Stock Exchange",".OL","15 min","Telekurs"]
[null,"Singapore","Singapore Stock Exchange",".SI","20 min","Interactive Data Real-Time Services"]
{"$rows_left_out":32}
{"sheet":"Função Excel","index":4,"n_rows":19,"n_cols":3,"rows_kept":19,"cut":false,"hidden":false,"merged":[[13,2,16,15]]}
[]
[]
[]
[]
[]
[]
[null,null,"Histórico de cotações"]
[null,null,"Versão 2.0 - DEMO"]
[]
[null,null,"O que é o Função Excel?"]
[null,null,"O Função Excel é um site de conteúdo gratuíto sobre a mais utilizada ferramenta de análise e controle de dados do mundo, o Microsoft Excel.\n"]
[]
[null,null,"O que o Função Excel tem a oferecer?"]
[null,null,"Além do conteúdo disponibilizado no site www.funcaoexcel.com.br e nas redes sociais, o Função Excel também elabora planilhas e sistemas em Excel sob encomenda para os mais variados fins. Entre alguns deles estão: controle de fluxo para empresas, controle de estoque, controle gerencial de tomada de decisão, sistema analítico para escritórios de contabilidade, sistema de vendas para lojistas."]
[]
[]
[]
[null,null,"Como posso entrar em contato?"]
[null,null,"Você pode entrar em contato direto com o Função Excel através do e-mail funcaoexcel@gmail.com ou pelos links à esquerda."]