{"text_format":"1","workbook":"xlsx","n_sheets":7,"sheets":["Início","Calculadora Financeira","Juros Simples x Compostos","Fórmulas","Calculadora Estendida","Sistema de Pagamentos","Glossário"],"not_rendered":{"charts":5,"images":2,"macros":1,"external_links":0,"defined_names":0,"comments":0,"pivot_tables":0},"unopened":[],"bounds":{"document_bytes":16777216,"sheet_cells":100000,"rows_first":2000,"rows_last":500,"rows_between":2000,"halvings":0,"cell_chars":16384,"cell_head_chars":4096},"cells_cut":0,"cells_raw":0,"read":"whole","date_system":"1900"}

{"sheet":"Início","index":0,"n_rows":7,"n_cols":8,"rows_kept":7,"cut":false,"hidden":false,"merged":[]}
[]
[]
[]
[]
[]
[null,null,null,null,null,null,null,"1. APERTE NO BOTÃO HABILITAR EDIÇÃO"]
[null,null,null,null,null,null,null,"2. APERTE NO BOTÃO HABILITAR CONTEÚDO"]

{"sheet":"Calculadora Financeira","index":1,"n_rows":3,"n_cols":2,"rows_kept":3,"cut":false,"hidden":true,"merged":[[2,1,2,6]]}
[]
[]
[null,"Calculadora"]

{"sheet":"Juros Simples x Compostos","index":2,"n_rows":121,"n_cols":16,"rows_kept":121,"cut":false,"hidden":true,"merged":[[1,5,1,12],[2,15,7,18],[3,10,3,12]]}
["Mês","Juros Simples","Juros Compostos"]
[1,{"$f":"'Juros Simples x Compostos'!$I$6*(1+'Juros Simples x Compostos'!$I$5)","v":21000},{"$f":"'Juros Simples x Compostos'!$I$6*(1+'Juros Simples x Compostos'!$I$5)","v":21000}]
[{"$f":"A2+1","v":2},{"$f":"'Juros Simples x Compostos'!$I$6*'Juros Simples x Compostos'!$I$5+B2","v":22000},{"$f":"C2*(1+'Juros Simples x Compostos'!$I$5)","v":22050},null,null,null,null,null,null,null,null,null,null,null,null,"Aqui é possível visualizar graficamente a diferença entre o juros simples e o composto. Altere os valores das células pontilhadas para fazer simulações."]
[3,{"$f":"'Juros Simples x Compostos'!$I$6*'Juros Simples x Compostos'!$I$5+B3","v":23000},{"$f":"C3*(1+'Juros Simples x Compostos'!$I$5)","v":23152.5},null,null,"Tempo de aplicação em meses",null,null,120,null,"Montante Final"]
[4,{"$f":"'Juros Simples x Compostos'!$I$6*'Juros Simples x Compostos'!$I$5+B4","v":24000},{"$f":"C4*(1+'Juros Simples x Compostos'!$I$5)","v":24310.125},null,null,"Taxa de juros ao mês (%)",null,null,0.05,null,"Juros Compostos",null,{"$f":"INDEX(C:C,'Juros Simples x Compostos'!I4+1)","v":6978239.7133440645}]
[5,{"$f":"'Juros Simples x Compostos'!$I$6*'Juros Simples x Compostos'!$I$5+B5","v":25000},{"$f":"C5*(1+'Juros Simples x Compostos'!$I$5)","v":25525.631250000002},null,null,"Capital inicial (R$)",null,null,20000,null,"Juros Simples",null,{"$f":"INDEX(B:B,'Juros Simples x Compostos'!I4+1)","v":140000}]
[6,{"$f":"'Juros Simples x Compostos'!$I$6*'Juros Simples x Compostos'!$I$5+B6","v":26000},{"$f":"C6*(1+'Juros Simples x Compostos'!$I$5)","v":26801.912812500002}]
[7,{"$f":"'Juros Simples x Compostos'!$I$6*'Juros Simples x Compostos'!$I$5+B7","v":27000},{"$f":"C7*(1+'Juros Simples x Compostos'!$I$5)","v":28142.008453125003}]
[8,{"$f":"'Juros Simples x Compostos'!$I$6*'Juros Simples x Compostos'!$I$5+B8","v":28000},{"$f":"C8*(1+'Juros Simples x Compostos'!$I$5)","v":29549.108875781254}]
[9,{"$f":"'Juros Simples x Compostos'!$I$6*'Juros Simples x Compostos'!$I$5+B9","v":29000},{"$f":"C9*(1+'Juros Simples x Compostos'!$I$5)","v":31026.56431957032}]
[10,{"$f":"'Juros Simples x Compostos'!$I$6*'Juros Simples x Compostos'!$I$5+B10","v":30000},{"$f":"C10*(1+'Juros Simples x Compostos'!$I$5)","v":32577.892535548835}]
[11,{"$f":"'Juros Simples x Compostos'!$I$6*'Juros Simples x Compostos'!$I$5+B11","v":31000},{"$f":"C11*(1+'Juros Simples x Compostos'!$I$5)","v":34206.787162326276}]
[12,{"$f":"'Juros Simples x Compostos'!$I$6*'Juros Simples x Compostos'!$I$5+B12","v":32000},{"$f":"C12*(1+'Juros Simples x Compostos'!$I$5)","v":35917.126520442594}]
[13,{"$f":"'Juros Simples x Compostos'!$I$6*'Juros Simples x Compostos'!$I$5+B13","v":33000},{"$f":"C13*(1+'Juros Simples x Compostos'!$I$5)","v":37712.982846464729}]
[14,{"$f":"'Juros Simples x Compostos'!$I$6*'Juros Simples x Compostos'!$I$5+B14","v":34000},{"$f":"C14*(1+'Juros Simples x Compostos'!$I$5)","v":39598.631988787965}]
[15,{"$f":"'Juros Simples x Compostos'!$I$6*'Juros Simples x Compostos'!$I$5+B15","v":35000},{"$f":"C15*(1+'Juros Simples x Compostos'!$I$5)","v":41578.563588227364}]
[16,{"$f":"'Juros Simples x Compostos'!$I$6*'Juros Simples x Compostos'!$I$5+B16","v":36000},{"$f":"C16*(1+'Juros Simples x Compostos'!$I$5)","v":43657.491767638734}]
[17,{"$f":"'Juros Simples x Compostos'!$I$6*'Juros Simples x Compostos'!$I$5+B17","v":37000},{"$f":"C17*(1+'Juros Simples x Compostos'!$I$5)","v":45840.36635602067}]
[18,{"$f":"'Juros Simples x Compostos'!$I$6*'Juros Simples x Compostos'!$I$5+B18","v":38000},{"$f":"C18*(1+'Juros Simples x Compostos'!$I$5)","v":48132.384673821703}]
[19,{"$f":"'Juros Simples x Compostos'!$I$6*'Juros Simples x Compostos'!$I$5+B19","v":39000},{"$f":"C19*(1+'Juros Simples x Compostos'!$I$5)","v":50539.003907512793}]
[20,{"$f":"'Juros Simples x Compostos'!$I$6*'Juros Simples x Compostos'!$I$5+B20","v":40000},{"$f":"C20*(1+'Juros Simples x Compostos'!$I$5)","v":53065.954102888434}]
[21,{"$f":"'Juros Simples x Compostos'!$I$6*'Juros Simples x Compostos'!$I$5+B21","v":41000},{"$f":"C21*(1+'Juros Simples x Compostos'!$I$5)","v":55719.251808032859}]
[22,{"$f":"'Juros Simples x Compostos'!$I$6*'Juros Simples x Compostos'!$I$5+B22","v":42000},{"$f":"C22*(1+'Juros Simples x Compostos'!$I$5)","v":58505.214398434502}]
[23,{"$f":"'Juros Simples x Compostos'!$I$6*'Juros Simples x Compostos'!$I$5+B23","v":43000},{"$f":"C23*(1+'Juros Simples x Compostos'!$I$5)","v":61430.475118356233}]
[24,{"$f":"'Juros Simples x Compostos'!$I$6*'Juros Simples x Compostos'!$I$5+B24","v":44000},{"$f":"C24*(1+'Juros Simples x Compostos'!$I$5)","v":64501.998874274046}]
[25,{"$f":"'Juros Simples x Compostos'!$I$6*'Juros Simples x Compostos'!$I$5+B25","v":45000},{"$f":"C25*(1+'Juros Simples x Compostos'!$I$5)","v":67727.098817987746}]
[26,{"$f":"'Juros Simples x Compostos'!$I$6*'Juros Simples x Compostos'!$I$5+B26","v":46000},{"$f":"C26*(1+'Juros Simples x Compostos'!$I$5)","v":71113.453758887132}]
[27,{"$f":"'Juros Simples x Compostos'!$I$6*'Juros Simples x Compostos'!$I$5+B27","v":47000},{"$f":"C27*(1+'Juros Simples x Compostos'!$I$5)","v":74669.126446831491}]
[28,{"$f":"'Juros Simples x Compostos'!$I$6*'Juros Simples x Compostos'!$I$5+B28","v":48000},{"$f":"C28*(1+'Juros Simples x Compostos'!$I$5)","v":78402.582769173066}]
[29,{"$f":"'Juros Simples x Compostos'!$I$6*'Juros Simples x Compostos'!$I$5+B29","v":49000},{"$f":"C29*(1+'Juros Simples x Compostos'!$I$5)","v":82322.711907631718}]
[30,{"$f":"'Juros Simples x Compostos'!$I$6*'Juros Simples x Compostos'!$I$5+B30","v":50000},{"$f":"C30*(1+'Juros Simples x Compostos'!$I$5)","v":86438.847503013312}]
[31,{"$f":"'Juros Simples x Compostos'!$I$6*'Juros Simples x Compostos'!$I$5+B31","v":51000},{"$f":"C31*(1+'Juros Simples x Compostos'!$I$5)","v":90760.789878163981}]
[32,{"$f":"'Juros Simples x Compostos'!$I$6*'Juros Simples x Compostos'!$I$5+B32","v":52000},{"$f":"C32*(1+'Juros Simples x Compostos'!$I$5)","v":95298.829372072185}]
[33,{"$f":"'Juros Simples x Compostos'!$I$6*'Juros Simples x Compostos'!$I$5+B33","v":53000},{"$f":"C33*(1+'Juros Simples x Compostos'!$I$5)","v":100063.7708406758}]
[34,{"$f":"'Juros Simples x Compostos'!$I$6*'Juros Simples x Compostos'!$I$5+B34","v":54000},{"$f":"C34*(1+'Juros Simples x Compostos'!$I$5)","v":105066.9593827096}]
[35,{"$f":"'Juros Simples x Compostos'!$I$6*'Juros Simples x Compostos'!$I$5+B35","v":55000},{"$f":"C35*(1+'Juros Simples x Compostos'!$I$5)","v":110320.30735184508}]
[36,{"$f":"'Juros Simples x Compostos'!$I$6*'Juros Simples x Compostos'!$I$5+B36","v":56000},{"$f":"C36*(1+'Juros Simples x Compostos'!$I$5)","v":115836.32271943735}]
[37,{"$f":"'Juros Simples x Compostos'!$I$6*'Juros Simples x Compostos'!$I$5+B37","v":57000},{"$f":"C37*(1+'Juros Simples x Compostos'!$I$5)","v":121628.13885540923}]
[38,{"$f":"'Juros Simples x Compostos'!$I$6*'Juros Simples x Compostos'!$I$5+B38","v":58000},{"$f":"C38*(1+'Juros Simples x Compostos'!$I$5)","v":127709.54579817969}]
[39,{"$f":"'Juros Simples x Compostos'!$I$6*'Juros Simples x Compostos'!$I$5+B39","v":59000},{"$f":"C39*(1+'Juros Simples x Compostos'!$I$5)","v":134095.0230880887}]
{"$rows_left_out":82}
{"sheet":"Fórmulas","index":3,"n_rows":20,"n_cols":6,"rows_kept":20,"cut":false,"hidden":true,"merged":[[1,4,1,5],[2,1,3,1],[4,1,5,1],[18,1,19,1],[1,1,1,2],[12,1,13,1],[14,1,16,1],[8,1,9,1],[7,4,14,4]]}
[]
[null,"CALCULADORA",null,null,"EQUIVALÊNCIA DE TAXAS"]
[null,"M = Montante (Bruto)","M = [Ci * (1 + i)^t]",null,"ip = Taxa Procurada","ip = [(1 + ic) ^ (tip / tic)] - 1"]
[null,null,"M = MA - S",null,"ic = Taxa Conhecida","ic = [(1 + ip) ^ (tic / tip)] - 1"]
[null,"MA = Montante + Aportes (Bruto)","MA = M + S",null,"tic = Tempo em meses da taxa conhecida","tic = [log(1 + ic) / log(1 + ip)] * tip"]
[null,null,"MA = [Ci * (1 + i)^t] + A * {[(1 + i)^t - 1] / [(1 + i) - 1]}",null,"tip = Tempo em meses da taxa desejada","tip = [log(1 + ip) / log(1 + ic)] * tip"]
[null,"ML = Montante (Líquido)","ML = M(Real)"]
[null,"MAL = Montante + Aportes (Líquido)","MAL = M(Real) + S(Real)",null,"Consulte aqui as fórmulas matemáticas utilizadas nos calculos da Calculadora Financeira"]
[null,"Ci = Capital Inicial","Ci = MA / (1 + i)^t - S"]
[null,null,"Ci = MA / (1 + i)^t - A * {[(1 + i)^t - 1] / [(1 + i) - 1]}"]
[null,"i = Taxa de Juros","i = [(MA - S) / Ci]^(1 / t) - 1"]
[null,"t = Tempo","t = log[(MA - S) / Ci] / log(1 + i)"]
[null,"A = Aporte","A = MA - [Ci * (1 + i)^t] / {[(1 + i)^t - 1] / [(1 + i) - 1]}"]
[null,null,"A = S / {[(1 + i)^t - 1] / [(1 + i) - 1]}"]
[null,"S = Aportes no tempo","S = A * {[(1 + i)^t - 1] / [(1 + i) - 1]}"]
[null,null,"S = MA - [Ci * (1 + i)^t]"]
[null,null,"S = MA - M"]
[null,"IFL = Inflação a cada intervalo de tempo",0]
[null,"iR = Taxa de Juros Real","iR = (1 + i) / (1 + IFL) - 1"]
[null,null,"iR = (1 + {[M / Ci]^(1 / t)} - 1) / (1 + IFL) - 1"]

{"sheet":"Calculadora Estendida","index":4,"n_rows":157,"n_cols":12,"rows_kept":157,"cut":false,"hidden":true,"merged":[[1,1,2,9],[5,11,10,14],[12,11,16,14],[18,11,23,14]]}
[]
[null,"Calculadora de investimentos a Juros Compostos - Estendida"]
[]
[]
[null,"Tempo ","Montante + Aportes (Bruto)","Montante + Aportes (Líquido)","Aporte (+) ou Saque (-)","Capital Inicial","Taxa de juros","Aportes e Saques no tempo","Montante Bruto","Taxa de Inflação"]
[null,0,0,0,0,2000,0,{"$f":"IF(E6=\"\",\"\",E6*(1+G6))","v":0},0,0,null,"Aqui é possível fazer estimativas com valores de Taxa de juros, Aporte ou Saque e Taxa de Inflação que mudam ao longo do tempo, além de poder visualizar a evolução do patrimônio a cada período de tempo"]
[null,{"$f":"B6+1","v":1},{"$f":"IFERROR(IF(G7=\"\",\"\",(F6+E7)*(1+G7)),\"\")","v":2029.9999999999998},{"$f":"IFERROR(IF(G7=\"\",\"\",(F6+E7)*((1+G7)/(1+J7))),\"\")","v":2029.9999999999998},null,null,1.4999999999999999E-2,{"$f":"IFERROR(IF(G7=\"\",\"\",(H6+E7)*(1+G7)),\"\")","v":0},{"$f":"IFERROR(IF(G7=\"\",\"\",(F6)*(1+G7)),\"\")","v":2029.9999999999998},0]
[null,{"$f":"B7+1","v":2},{"$f":"IFERROR(IF(G8=\"\",\"\",(C7+E8)*(1+G8)),\"\")","v":2060.4499999999994},{"$f":"IFERROR(IF(G8=\"\",\"\",(D7+E8)*((1+G8)/(1+J8))),\"\")","v":2060.4499999999994},null,null,1.4999999999999999E-2,{"$f":"IFERROR(IF(G8=\"\",\"\",(H7+E8)*(1+G8)),\"\")","v":0},{"$f":"IFERROR(IF(G8=\"\",\"\",(I7)*(1+G8)),\"\")","v":2060.4499999999994},0]
[null,3,2091.356749999999,2091.356749999999,null,null,1.4999999999999999E-2,0,2091.356749999999,0]
[null,4,2122.7271012499987,2122.7271012499987,null,null,1.4999999999999999E-2,0,2122.7271012499987,0]
[null,5,2154.5680077687484,2154.5680077687484,null,null,1.4999999999999999E-2,0,2154.5680077687484,0]
[null,6,2186.8865278852795,{"$f":"IFERROR(IF(G12=\"\",\"\",(D11+E12)*((1+G12)/(1+J12))),\"\")","v":2186.8865278852795},null,null,1.4999999999999999E-2,0,2186.8865278852795,0]
[null,7,2219.6898258035585,{"$f":"IFERROR(IF(G13=\"\",\"\",(D12+E13)*((1+G13)/(1+J13))),\"\")","v":2219.6898258035585},null,null,1.4999999999999999E-2,0,2219.6898258035585,0,null,"Altere somente os valores para Taxa de Juros, Capital Inicial, Aporte ou Saque e Taxa de Inflação"]
[null,8,2252.9851731906115,2252.9851731906115,null,null,1.4999999999999999E-2,0,2252.9851731906115,0]
[null,9,2286.7799507884706,2286.7799507884706,null,null,1.4999999999999999E-2,0,2286.7799507884706,0]
[null,10,2321.0816500502974,2321.0816500502974,null,null,1.4999999999999999E-2,0,2321.0816500502974,0]
[null,11,2355.8978748010518,2355.8978748010518,null,null,1.4999999999999999E-2,0,2355.8978748010518,0]
[null,12,2391.2363429230672,2391.2363429230672,null,null,1.4999999999999999E-2,0,2391.2363429230672,0]
[null,13,{"$f":"IFERROR(IF(G19=\"\",\"\",(C18+E19)*(1+G19)),\"\")","v":2427.1048880669132},{"$f":"IFERROR(IF(G19=\"\",\"\",(D18+E19)*((1+G19)/(1+J19))),\"\")","v":2427.1048880669132},null,null,1.4999999999999999E-2,{"$f":"IFERROR(IF(G19=\"\",\"\",(H18+E19)*(1+G19)),\"\")","v":0},{"$f":"IFERROR(IF(G19=\"\",\"\",(I18)*(1+G19)),\"\")","v":2427.1048880669132},0,null,"Com exceção do Capital Inicial deixe sempre a primeira linha (Tempo 0) em branco, pois representa a situação inicial"]
[null,14,2463.5114613879168,2463.5114613879168,null,null,1.4999999999999999E-2,0,2463.5114613879168,0]
[null,15,2500.4641333087352,2500.4641333087352,null,null,1.4999999999999999E-2,0,2500.4641333087352,0]
[null,16,2537.9710953083659,2537.9710953083659,null,null,1.4999999999999999E-2,0,2537.9710953083659,0]
[null,17,2576.0406617379913,2576.0406617379913,null,null,1.4999999999999999E-2,0,2576.0406617379913,0]
[null,18,2614.6812716640611,2614.6812716640611,null,null,1.4999999999999999E-2,0,2614.6812716640611,0]
[null,19,{"$f":"IFERROR(IF(G25=\"\",\"\",(C24+E25)*(1+G25)),\"\")","v":2653.9014907390219},{"$f":"IFERROR(IF(G25=\"\",\"\",(D24+E25)*((1+G25)/(1+J25))),\"\")","v":2653.9014907390219},null,null,1.4999999999999999E-2,{"$f":"IFERROR(IF(G25=\"\",\"\",(H24+E25)*(1+G25)),\"\")","v":0},{"$f":"IFERROR(IF(G25=\"\",\"\",(I24)*(1+G25)),\"\")","v":2653.9014907390219},0]
[null,20,2693.7100131001071,2693.7100131001071,null,null,1.4999999999999999E-2,0,2693.7100131001071,0]
[null,21,1414.6156632966085,1414.6156632966085,-1300,null,1.4999999999999999E-2,-1319.4999999999998,2734.1156632966085,0]
[null,22]
[null,23]
[null,24]
[null,25]
[null,26]
[null,27,"","",null,null,null,"",""]
[null,28,"","",null,null,null,"",""]
[null,29,"","",null,null,null,"",""]
[null,30,"","",null,null,null,"",""]
[null,31,"","",null,null,null,"",""]
[null,32,"","",null,null,null,"",""]
[null,33,"","",null,null,null,"",""]
[null,34,"","",null,null,null,"",""]
{"$rows_left_out":118}
{"sheet":"Sistema de Pagamentos","index":5,"n_rows":57,"n_cols":12,"rows_kept":57,"cut":false,"hidden":true,"merged":[[5,11,11,14],[13,11,19,14],[2,2,2,3],[3,2,3,3],[1,2,1,5],[1,6,1,9],[2,6,2,7],[3,6,3,7]]}
[]
[null,null,"Sistema PRICE",null,null,null,"Sistema SAC"]
[null,null,"Total Financiado",null,"Taxa de Juros","N de parcelas","Total Financiado",null,"Taxa de Juros","N de parcelas"]
[null,null,9000,null,0.02,50,9000,null,0.02,50]
[null,null,"Parcela","Amortização","Juros","Saldo Devedor","Parcela","Amortização","Juros","Saldo Devedor"]
[null,0,null,null,null,{"$f":"C4","v":9000},null,null,null,{"$f":"G4","v":9000},null,"Sistema PRICE apresenta parcelas constantes no tempo, inicialmente mais suaves porém acaba-se pagando mais juros"]
[null,1,{"$f":"IF($F$4>=B7,$C$4*($E$4*(1+$E$4)^$F$4)/((1+$E$4)^($F$4)-1),\"\")","v":286.40888733326915},{"$f":"IFERROR(C7-E7,\"\")","v":106.40888733326915},{"$f":"IFERROR(F6*$E$4,\"\")","v":180},{"$f":"IF($F$4>=B7,IF($F$4=B7,ROUND(F6-D7,2),F6-D7),\"\")","v":8893.5911126667306},{"$f":"IFERROR(H7+I7,\"\")","v":360},{"$f":"IF($J$4>=B7,$G$4/$J$4,\"\")","v":180},{"$f":"IFERROR(J6*$E$4,\"\")","v":180},{"$f":"IF($J$4>=B7,IF($J$4=B7,ROUND(J6-H7,2),J6-H7),\"\")","v":8820}]
[null,2,{"$f":"IF($F$4>=B8,$C$4*($E$4*(1+$E$4)^$F$4)/((1+$E$4)^($F$4)-1),\"\")","v":286.40888733326915},{"$f":"IFERROR(C8-E8,\"\")","v":108.53706507993454},177.87182225333461,8785.0540475867965,{"$f":"IFERROR(H8+I8,\"\")","v":356.4},{"$f":"IF($J$4>=B8,$G$4/$J$4,\"\")","v":180},{"$f":"IFERROR(J7*$E$4,\"\")","v":176.4},8640]
[null,3,286.40888733326915,110.7078063815332,175.70108095173595,8674.3462412052631,352.8,180,172.8,8460]
[null,4,286.40888733326915,112.92196250916388,173.48692482410527,8561.4242786960986,349.20000000000005,180,169.20000000000002,8280]
[null,5,286.40888733326915,115.18040175934718,171.22848557392197,8446.2438769367509,345.6,180,165.6,8100]
[null,6,286.40888733326915,117.48400979453413,168.92487753873502,8328.7598671422165,342,180,162,7920]
[null,7,286.40888733326915,119.8336899904248,166.57519734284435,8208.9261771517922,338.4,180,158.4,7740]
[null,8,286.40888733326915,122.2303637902333,164.17852354303585,8086.695813361559,334.8,180,154.80000000000001,7560,null,"Sistema SAC apresenta amortizações constantes no tempo, parcelas inicialmente mais altas, porém acaba-se pagando menos juros"]
[null,9,286.40888733326915,124.67497106603795,161.73391626723119,7962.0208422955211,331.20000000000005,180,151.20000000000002,7380]
[null,10,286.40888733326915,127.16847048735872,159.24041684591043,7834.8523718081624,327.60000000000002,180,147.6,7200]
[null,11,286.40888733326915,129.7118398971059,156.69704743616325,7705.1405319110563,324,180,144,7020]
[null,12,286.40888733326915,132.30607669504801,154.10281063822114,7572.8344552160079,320.39999999999998,180,140.4,6840]
[null,13,286.40888733326915,134.95219822894899,151.45668910432016,7437.882256987059,316.8,180,136.80000000000001,6660]
[null,14,286.40888733326915,137.65124219352796,148.75764513974119,7300.2310147935314,313.2,180,133.19999999999999,6480]
[null,15,286.40888733326915,140.40426703739851,146.00462029587064,7159.826747756133,309.60000000000002,180,129.6,6300]
[null,16,286.40888733326915,143.21235237814648,143.19653495512267,7016.6143953779865,306,180,126,6120]
[null,17,286.40888733326915,146.07659942570942,140.33228790755973,6870.5377959522775,302.39999999999998,180,122.4,5940]
[null,18,286.40888733326915,148.99813141422359,137.41075591904556,6721.5396645380542,298.8,180,118.8,5760]
[null,19,286.40888733326915,151.97809404250808,134.43079329076107,6569.5615704955462,295.2,180,115.2,5580]
[null,20,286.40888733326915,155.01765592335823,131.39123140991092,6414.5439145721884,291.60000000000002,180,111.60000000000001,5400]
[null,21,286.40888733326915,158.11800904182539,128.29087829144376,6256.4259055303628,288,180,108,5220]
[null,22,286.40888733326915,161.28036922266188,125.12851811060726,6095.1455363077011,284.39999999999998,180,104.4,5040]
[null,23,286.40888733326915,164.50597660711514,121.90291072615402,5930.6395597005858,280.8,180,100.8,4860]
[null,24,286.40888733326915,167.79609613925743,118.61279119401172,5762.8434635613285,277.2,180,97.2,4680]
[null,25,286.40888733326915,171.15201806204257,115.25686927122658,5591.6914454992857,273.60000000000002,180,93.600000000000009,4500]
[null,26,286.40888733326915,174.57505842328345,111.83382890998571,5417.116387076002,270,180,90,4320]
[null,27,286.40888733326915,178.06655959174913,108.34232774152004,5239.049827484253,266.39999999999998,180,86.4,4140]
[null,28,286.40888733326915,181.62789078358409,104.78099654968506,5057.421936700669,262.8,180,82.8,3960]
[null,29,286.40888733326915,185.26044859925577,101.14843873401338,4872.1614881014129,259.2,180,79.2,3780]
[null,30,286.40888733326915,188.96565757124088,97.443229762028267,4683.1958305301723,255.60000000000002,180,75.600000000000009,3600]
[null,31,286.40888733326915,192.7449707226657,93.663916610603451,4490.4508598075063,252,180,72,3420]
[null,32,286.40888733326915,196.59987013711901,89.809017196150123,4293.8509896703872,248.4,180,68.400000000000006,3240]
[null,33,286.40888733326915,200.53186753986142,85.87701979340774,4093.319122130526,244.8,180,64.8,3060]
[null,34,286.40888733326915,204.54250489065862,81.866382442610515,3888.7766172398674,241.2,180,61.2,2880]
{"$rows_left_out":18}
{"sheet":"Glossário","index":6,"n_rows":39,"n_cols":3,"rows_kept":39,"cut":false,"hidden":true,"merged":[[3,2,7,12],[9,2,10,12],[2,1,2,12],[8,1,8,12],[11,1,11,12],[13,1,13,12],[16,1,16,12],[19,1,19,12],[26,1,26,12],[14,2,15,12],[17,2,18,12],[20,2,22,12],[38,2,38,12],[27,2,28,12],[30,2,31,12],[33,2,34,12],[23,1,23,12],[24,2,25,12],[29,1,29,12],[32,1,32,12],[35,1,35,12],[37,1,37,12],[36,2,36,12]]}
[]
[null,"Glossário"]
[null,"Amortização"]
[null,null,"É a redução de dívida por meio de pagamento parcial ou gradual acertado entre as partes.\nÉ um processo de extinção de uma dívida através de pagamentos periódicos, que são realizados em função de um planejamento, de modo que cada prestação corresponde à soma do reembolso do capital ou do pagamento dos juros do saldo devedor, podendo ser o reembolso de ambos, sendo que os juros são sempre calculados sobre o saldo devedor."]
[]
[]
[]
[]
[null,"Aporte"]
[null,null,"Significa subsídio, contribuição. É um termo muito utilizado no meio empresarial. Aporte é mais usado como uma contribuição financeira, um dinheiro ou uma ajuda utilizada para um determinado fim."]
[]
[null,"Capital Inicial"]
[null,null,"É a quantia em dinheiro que se possui no momento que se inicia um investimento."]
[null,"Equivalência de Taxas"]
[null,null,"São taxas que quando aplicadas ao mesmo capital, num mesmo intervalo de tempo, produzem montantes iguais, porém estão em tempo diferentes. Exemplo taxa ao ano e taxa ao mês."]
[]
[null,"Inflação"]
[null,null,"É um conceito que designa o aumento continuado e generalizado dos preços dos bens e serviço. Também pode ser entendido como a perda do poder de compra de uma moeda."]
[]
[null,"Juros Compostos"]
[null,null,"Juros sobre juros.\nOs juros de cada período são somados ao capital para o cálculo de novos juros nos períodos seguintes. Nesse caso, o valor da dívida é sempre corrigida e a taxa de juros é calculada sobre esse valor."]
[]
[]
[null,"Juros Simples"]
[null,null,"A taxa de juros é aplicada sobre o principal (valor emprestado ou capital inicial) de forma linear, ou seja, não considera que o saldo da dívida aumenta ou diminui conforme o passar do tempo."]
[]
[null,"Montante Bruto"]
[null,null,"É a quantia em dinheiro que se possui após a incidência de juros sobre o capital inicial antes do desconto da inflação e impostos."]
[]
[null,"Montante Líquido"]
[null,null,"É a quantia em dinheiro que se possui após a incidência de juros sobre o capital inicial após o desconto da inflação e impostos."]
[]
[null,"Sistema de Pagamento"]
[null,null,"Também conhecido como Sistema de Amortização, é um metodo utilizado para se calcula o pagamento de dívidas entre credor e devedor."]
[]
[null,"Taxa de Juros"]
[null,null,"É o preço do dinheiro no tempo."]
[null,"Taxa de Juros Real"]
[null,null,"É a taxa de juros já descontado o efeito da inflação."]