{"text_format":"1","workbook":"xlsx","n_sheets":7,"sheets":["Função Excel","Em Andamento","Encerradas","Backup","PréCálculo","Sobre Função Excel","Auxiliar"],"not_rendered":{"charts":0,"images":14,"macros":1,"external_links":0,"defined_names":6,"comments":0,"pivot_tables":0},"unopened":[],"bounds":{"document_bytes":16777216,"sheet_cells":100000,"rows_first":2000,"rows_last":500,"rows_between":2000,"halvings":0,"cell_chars":16384,"cell_head_chars":4096},"cells_cut":0,"cells_raw":0,"read":"whole","date_system":"1900"}

{"sheet":"Função Excel","index":0,"n_rows":0,"n_cols":0,"rows_kept":0,"cut":false,"hidden":false,"merged":[]}

{"sheet":"Em Andamento","index":1,"n_rows":11,"n_cols":23,"rows_kept":11,"cut":false,"hidden":true,"merged":[[9,22,10,22],[9,19,10,19],[9,20,10,20],[9,21,10,21],[9,13,9,15],[9,16,9,18],[9,1,10,1],[9,4,10,4],[9,5,10,5],[9,6,10,6],[9,12,10,12],[9,2,9,3],[9,7,10,7],[9,8,10,8],[9,10,10,10],[9,9,10,9],[9,11,10,11],[5,1,5,2],[7,1,7,2],[5,3,5,4],[6,3,6,4],[6,1,6,2],[7,3,7,4]]}
[]
[]
[]
[]
[]
[null,"Nº de Operações",null,{"$f":"(COUNTA(H:H)-1)/2","v":0}]
[null,"Acumulado",null,{"$f":"IFERROR(SOMACOR(INDIRECT(\"L13\"),INDIRECT(\"L13:L\"&11+D6*2)),0)","v":0}]
[null,"Média",null,{"$f":"IFERROR(D7/D6,0)","v":0}]
[]
[null,"Operação","Ativo",null,"Data","Cotação","Quantidade","Subtotal","Custos e Taxas","Ajuste Manual","Total","Resultado","Ganho Mínimo","Stop Gain",null,null,"Stop Loss",null,null,"Motivo Entrada","Motivo Stop Gain","Motivo Stop Loss","Motivo Saìda"]
[null,null,"Código","Tipo",null,null,null,null,null,null,null,null,null,"Stop Gain %","Stop Gain Auto.","Stop Gain Man.","Stop Loss %","Stop Loss Auto.","Stop Loss Man."]

{"sheet":"Encerradas","index":2,"n_rows":17,"n_cols":28,"rows_kept":17,"cut":false,"hidden":true,"merged":[[15,27,16,27],[12,27,13,27],[15,26,16,26],[12,1,12,2],[12,3,12,4],[13,3,13,4],[12,26,13,26],[15,25,16,25],[15,23,16,23],[15,24,16,24],[15,19,16,19],[15,20,16,20],[15,21,16,21],[15,22,16,22],[15,7,16,7],[13,1,13,2],[15,1,16,1],[15,2,15,3],[15,4,16,4],[15,5,16,5],[12,23,13,23],[15,6,16,6],[15,8,16,8],[15,9,16,9],[15,16,15,18],[15,10,16,10],[15,11,16,11],[15,12,16,12],[15,13,15,15],[12,25,13,25],[5,6,5,11],[5,13,5,20],[12,24,13,24],[5,1,6,2],[8,1,8,2],[7,3,7,4],[8,3,8,4],[10,1,10,2],[10,3,10,4],[7,1,7,2],[11,1,11,2],[9,1,9,2],[9,3,9,4],[11,3,11,4]]}
[]
[]
[]
[]
[]
[null,"Período de análise",null,"De","Até",null,"Relatório de dias da semana",null,null,null,null,null,null,"Relatório de tipo de ativo"]
[null,null,null,"2017-06-01","2017-06-30",null,null,"Ganho","Perda","Acumulado","Nº de Ops.","Média",null,null,"Ganho","Perda","Acumulado","Nº de Op.","Média","Nº de Papeis","Média p/ Papel"]
[null,"Nº de Operações",null,{"$f":"IF(OR(D7=\"\",E7=\"\"),\"Selecione as datas\",COUNTIFS(X:X,\">=\"&D7,X:X,\"<=\"&E7))","v":0},null,null,"Segunda",{"$f":"SUMIFS($AA:$AA,$AA:$AA,\">0\",$Y:$Y,2,$X:$X,\">=\"&$D$7,$X:$X,\"<=\"&$E$7)","v":0},{"$f":"SUMIFS($AA:$AA,$AA:$AA,\"<0\",$Y:$Y,2,$X:$X,\">=\"&$D$7,$X:$X,\"<=\"&$E$7)","v":0},{"$f":"SUM(H8:I8)","v":0},{"$f":"COUNTIFS(Y:Y,2,$X:$X,\">=\"&$D$7,$X:$X,\"<=\"&$E$7)","v":0},{"$f":"IFERROR(J8/K8,0)","v":0},null,"Ação",{"$f":"SUMIFS($AA:$AA,$AA:$AA,\">0\",$D:$D,$N8,$X:$X,\">=\"&$D$7,$X:$X,\"<=\"&$E$7)","v":0},{"$f":"SUMIFS($AA:$AA,$AA:$AA,\"<0\",$D:$D,$N8,$X:$X,\">=\"&$D$7,$X:$X,\"<=\"&$E$7)","v":0},{"$f":"SUM(O8:P8)","v":0},{"$f":"COUNTIFS(D:D,N8,$X:$X,\">=\"&$D$7,$X:$X,\"<=\"&$E$7)","v":0},{"$f":"IFERROR(Q8/R8,0)","v":0},{"$f":"SUMIFS($G:$G,$D:$D,$N8,$X:$X,\">=\"&$D$7,$X:$X,\"<=\"&$E$7,$Z:$Z,\"Day Trade\")*2","v":0},{"$f":"IFERROR(Q8/T8,0)","v":0}]
[null,"Acumulado",null,{"$f":"SUMIFS(AA:AA,X:X,\">=\"&D7,X:X,\"<=\"&E7)","v":0},null,null,"Terça",{"$f":"SUMIFS($AA:$AA,$AA:$AA,\">0\",$Y:$Y,3,$X:$X,\">=\"&$D$7,$X:$X,\"<=\"&$E$7)","v":0},{"$f":"SUMIFS($AA:$AA,$AA:$AA,\"<0\",$Y:$Y,3,$X:$X,\">=\"&$D$7,$X:$X,\"<=\"&$E$7)","v":0},{"$f":"SUM(H9:I9)","v":0},{"$f":"COUNTIFS(Y:Y,3,$X:$X,\">=\"&$D$7,$X:$X,\"<=\"&$E$7)","v":0},{"$f":"IFERROR(J9/K9,0)","v":0},null,"Mini Dólar",{"$f":"SUMIFS($AA:$AA,$AA:$AA,\">0\",$D:$D,$N9,$X:$X,\">=\"&$D$7,$X:$X,\"<=\"&$E$7)","v":0},{"$f":"SUMIFS($AA:$AA,$AA:$AA,\"<0\",$D:$D,$N9,$X:$X,\">=\"&$D$7,$X:$X,\"<=\"&$E$7)","v":0},{"$f":"SUM(O9:P9)","v":0},{"$f":"COUNTIFS(D:D,N9,$X:$X,\">=\"&$D$7,$X:$X,\"<=\"&$E$7)","v":0},{"$f":"IFERROR(Q9/R9,0)","v":0},{"$f":"SUMIFS($G:$G,$D:$D,$N9,$X:$X,\">=\"&$D$7,$X:$X,\"<=\"&$E$7,$Z:$Z,\"Day Trade\")*2","v":0},{"$f":"IFERROR(Q9/T9,0)","v":0}]
[null,"Swing Trade",null,{"$f":"SUMIFS(AA:AA,Z:Z,B10,X:X,\">=\"&D7,X:X,\"<=\"&E7)","v":0},null,null,"Quarta",{"$f":"SUMIFS($AA:$AA,$AA:$AA,\">0\",$Y:$Y,4,$X:$X,\">=\"&$D$7,$X:$X,\"<=\"&$E$7)","v":0},{"$f":"SUMIFS($AA:$AA,$AA:$AA,\"<0\",$Y:$Y,4,$X:$X,\">=\"&$D$7,$X:$X,\"<=\"&$E$7)","v":0},0,{"$f":"COUNTIFS(Y:Y,4,$X:$X,\">=\"&$D$7,$X:$X,\"<=\"&$E$7)","v":0},0,null,"Mini Índice",{"$f":"SUMIFS($AA:$AA,$AA:$AA,\">0\",$D:$D,$N10,$X:$X,\">=\"&$D$7,$X:$X,\"<=\"&$E$7)","v":0},{"$f":"SUMIFS($AA:$AA,$AA:$AA,\"<0\",$D:$D,$N10,$X:$X,\">=\"&$D$7,$X:$X,\"<=\"&$E$7)","v":0},0,{"$f":"COUNTIFS(D:D,N10,$X:$X,\">=\"&$D$7,$X:$X,\"<=\"&$E$7)","v":0},0,{"$f":"SUMIFS($G:$G,$D:$D,$N10,$X:$X,\">=\"&$D$7,$X:$X,\"<=\"&$E$7,$Z:$Z,\"Day Trade\")*2","v":0},0]
[null,"Day Trade",null,{"$f":"SUMIFS(AA:AA,Z:Z,B11,X:X,\">=\"&D7,X:X,\"<=\"&E7)","v":0},null,null,"Quinta",{"$f":"SUMIFS($AA:$AA,$AA:$AA,\">0\",$Y:$Y,5,$X:$X,\">=\"&$D$7,$X:$X,\"<=\"&$E$7)","v":0},{"$f":"SUMIFS($AA:$AA,$AA:$AA,\"<0\",$Y:$Y,5,$X:$X,\">=\"&$D$7,$X:$X,\"<=\"&$E$7)","v":0},{"$f":"SUM(H11:I11)","v":0},{"$f":"COUNTIFS(Y:Y,5,$X:$X,\">=\"&$D$7,$X:$X,\"<=\"&$E$7)","v":0},{"$f":"IFERROR(J11/K11,0)","v":0}]
[null,"Média dia",null,{"$f":"IFERROR(D9/COUNTIFS($X:$X,\">=\"&$D$7,$X:$X,\"<=\"&$E$7,$AB:$AB,1),0)","v":0},null,{"$f":"\"Em \"&COUNTIFS($X:$X,\">=\"&$D$7,$X:$X,\"<=\"&$E$7,$AB:$AB,1)&\" dias.\"","v":"Em 0 dias."},"Sexta",{"$f":"SUMIFS($AA:$AA,$AA:$AA,\">0\",$Y:$Y,6,$X:$X,\">=\"&$D$7,$X:$X,\"<=\"&$E$7)","v":0},{"$f":"SUMIFS($AA:$AA,$AA:$AA,\"<0\",$Y:$Y,6,$X:$X,\">=\"&$D$7,$X:$X,\"<=\"&$E$7)","v":0},{"$f":"SUM(H12:I12)","v":0},{"$f":"COUNTIFS(Y:Y,6,$X:$X,\">=\"&$D$7,$X:$X,\"<=\"&$E$7)","v":0},{"$f":"IFERROR(J12/K12,0)","v":0}]
[null,"Média dos ganhos",null,{"$f":"IFERROR(SUMIFS($AA:$AA,$X:$X,\">=\"&$D$7,$X:$X,\"<=\"&$E$7,$AA:$AA,\">0\")/COUNTIFS($X:$X,\">=\"&$D$7,$X:$X,\"<=\"&$E$7,$AA:$AA,\">0\"),0)","v":0},null,{"$f":"IFERROR(\"Em \"&COUNTIFS($X:$X,\">=\"&$D$7,$X:$X,\"<=\"&$E$7,$AA:$AA,\">0\")&\" ops. (\"&ROUND(COUNTIFS($X:$X,\">=\"&$D$7,$X:$X,\"<=\"&$E$7,$AA:$AA,\">0\")/D8*100,0)&\"%)\",\"Sem ops.\")","v":"Sem ops."},null,{"$f":"SUM(H8:H12)","v":0},{"$f":"SUM(I8:I12)","v":0},{"$f":"SUM(J8:J12)","v":0},{"$f":"SUM(K8:K12)","v":0},{"$f":"IFERROR(J13/K13,0)","v":0},null,null,null,null,null,null,null,null,null,null,null,{"$f":"IF($G13=\"\",\"\",E14)","v":""},{"$f":"IF($G13=\"\",\"\",WEEKDAY(X13))","v":""},{"$f":"IF($G13=\"\",\"\",IF(E13=E14,\"Day Trade\",\"Swing Trade\"))","v":""},{"$f":"IF($G13=\"\",\"\",L14)","v":""},{"$f":"IF(G13=\"\",\"\",COUNTIF($E$13:E13,E13))","v":""}]
[null,"Média das perdas",null,{"$f":"IFERROR(SUMIFS($AA:$AA,$X:$X,\">=\"&$D$7,$X:$X,\"<=\"&$E$7,$AA:$AA,\"<0\")/COUNTIFS($X:$X,\">=\"&$D$7,$X:$X,\"<=\"&$E$7,$AA:$AA,\"<0\"),0)","v":0},null,{"$f":"IFERROR(\"Em \"&COUNTIFS($X:$X,\">=\"&$D$7,$X:$X,\"<=\"&$E$7,$AA:$AA,\"<0\")&\" ops. (\"&ROUND(COUNTIFS($X:$X,\">=\"&$D$7,$X:$X,\"<=\"&$E$7,$AA:$AA,\"<0\")/D8*100,0)&\"%)\",\"Sem ops.\")","v":"Sem ops."}]
[]
[null,"Operação","Ativo",null,"Data","Cotação","Quantidade","Subtotal","Custos e Taxas","Ajuste Manual","Total","Resultado","Ganho Minimo","Stop Gain",null,null,"Stop Loss",null,null,"Motivo Entrada","Motivo Stop Gain","Motivo Stop Loss","Motivo Saìda","Data","Dia da Semana","Tipo Op","Resultado","Conta Dias"]
[null,null,"Código","Tipo",null,null,null,null,null,null,null,null,null,"Stop Gain %","Stop Gain Auto.","Stop Gain Man.","Stop Loss %","Stop Loss Auto.","Stop Loss Man."]

{"sheet":"Backup","index":3,"n_rows":15,"n_cols":23,"rows_kept":15,"cut":false,"hidden":true,"merged":[[9,21,10,21],[9,22,10,22],[9,12,10,12],[9,13,9,15],[9,16,9,18],[9,19,10,19],[9,20,10,20],[9,7,10,7],[9,8,10,8],[9,9,10,9],[9,10,10,10],[9,11,10,11],[9,1,10,1],[9,2,9,3],[9,4,10,4],[9,5,10,5],[9,6,10,6],[11,19,12,19],[11,20,12,20],[11,21,12,21],[11,22,12,22],[11,14,12,14],[11,15,12,15],[11,16,12,16],[11,17,12,17],[11,18,12,18],[11,2,12,2],[11,3,12,3],[11,6,12,6],[11,12,12,12],[11,13,12,13],[0,0,0,1],[0,3,0,17],[0,19,0,21],[1,3,1,4],[1,5,1,10],[1,11,1,13],[1,14,1,17]]}
["Configurações Básicas",null,null,"Taxas",null,null,null,null,null,null,null,null,null,null,null,null,null,null,null,"Listas"]
["Ganho %",7.0000000000000001E-3,null,"Outras Taxas",null,"Emolumentos e Liquidação",null,null,null,null,null,"Corretagem",null,null,"Tabela de Corretagem BOVESPA",null,null,null,null,"Compra","Ação"]
["Perda %",3.0000000000000001E-3,null,"ISS SP",9.64E-2,"Mercado","Negociação","Liquidação","Registro","Emolumentos","Total","Tipo","Valor da Ordem","Valor Corretagem","Valor Inicial","Valor Final","Corretagem","Acréscimo",null,"Venda","Mini Dólar"]
["Operação Padrão","SwingTrade",null,"Outros Bovespa",3.9E-2,"À Vista",0,2.7500000000000002E-4,0,5.0000000000000002E-5,{"$f":"SUM(H4:J4)","v":3.2500000000000004E-4},"Day-Trade",0,8,1,135.07,0,2.7,null,null,"Mini Índice"]
["Corretagem","Fixa",null,null,null,"Day-trade",0,2.0000000000000001E-4,0,{"$f":"J4","v":5.0000000000000002E-5},2.5000000000000001E-4,"Day-Trade",10000,10,135.08000000000001,498.62,0.02,0]
["Tipo de Ativo","Ação",null,null,null,"Mini à vista",8.7000000000000001E-5,1.7E-5,7.6000000000000004E-5,0,9.3000000000000011E-5,"Day-Trade",25000,12,498.63,1514.69,1.4999999999999999E-2,2.4900000000000002]
[null,null,null,null,null,"Mini Day-trade",6.0999999999999999E-5,1.7E-5,1.5E-5,0,{"$f":"SUM(H7:J7)","v":3.1999999999999999E-5},"Normal",0,18.899999999999999,1514.7,3029.38,0.01,10.06]
[null,null,null,null,null,null,null,null,null,null,null,"Mini Day-trade",0,1,3029.39,99999.99,5.0000000000000001E-3,25.21]
[null,null,null,null,null,null,null,null,null,null,null,"Mini Normal",0,2]
[null,"Operação","Ativo",null,"Data","Cotação","Quantidade","Subtotal","Custos e Taxas","Ajuste Manual","Total","Resultado","Ganho Mínimo","Stop Gain",null,null,"Stop Loss",null,null,"Motivo Entrada","Motivo Stop Gain","Motivo Stop Loss","Motivo Saìda"]
[null,null,"Código","Tipo",null,null,null,null,null,null,null,null,null,"Stop Gain %","Stop Gain Auto.","Stop Gain Man.","Stop Loss %","Stop Loss Auto.","Stop Loss Man."]
[null,"Compra",null,"Mini Dólar",null,null,null,{"$f":"SUBTOTAL_A(H12)","v":0},{"$f":"CUSTOS_A(I12)","v":0},0,{"$f":"TOTAL_A(K12)","v":0},{"$f":"IFERROR(RESULTADO_A(L12),0)","v":0},{"$f":"IFERROR(GANHO_MÍNIMO(M12),0)","v":0},null,{"$f":"IFERROR(STOP_GAIN(O12),0)","v":0},null,null,{"$f":"IFERROR(STOP_LOSS(R12),0)","v":0}]
[null,{"$f":"IF(B12=\"Venda\",\"Compra\",IF(B12=\"Compra\",\"Venda\",\"\"))","v":"Venda"},null,null,null,null,null,{"$f":"SUBTOTAL_B(H13)","v":0},{"$f":"CUSTOS_B(I13)","v":0},0,{"$f":"TOTAL_B(K13)","v":0},{"$f":"RESULTADO_B(L13)","v":0}]
[null,null,null,null,"Stop Gain",null,null,{"$f":"IF(B12=\"Venda\",IF(AND(F12=\"\",F14=\"\"),0,F12*G12),F14*G12)*IF(D12<>\"Ação\",IF(D12=\"Mini Dólar\",10,1/5),1)","v":0},{"$f":"IF(E12=E13,H14*IF(D12=\"Ação\",Auxiliar!$H$5,Auxiliar!$K$7/2)+IF(D12=\"Ação\",0,G12*Auxiliar!$N$8),H14*IF(D12=\"Ação\",Auxiliar!$H$4,Auxiliar!$K$6/2)+IF(D12=\"Ação\",0,G12*Auxiliar!$N$9))\n+IF(D12=\"Ação\",IF(H14>H12,IF(E12=E13,H14*Auxiliar!$J$4,Auxiliar!$J$5),0)\n+IF(Corretagem=\"Fixa\",IF(E12=E13,VLOOKUP(H14,Auxiliar!$M$4:$N$6,2,TRUE),Auxiliar!$N$7),VLOOKUP(H14,Auxiliar!$O$4:$R$8,4,TRUE)+VLOOKUP(H14,Auxiliar!$O$4:$R$8,3,TRUE)*H14)\n*(1+Auxiliar!$E$3+Auxiliar!$E$4),0)\n+IF(D12=\"Mini Índice\",G12*IF(E12=E13,Auxiliar!$N$8,Auxiliar!$N$10)*(1+Auxiliar!$E$3+Auxiliar!$E$4),0)\n/IF(D12=\"Mini Índice\",2,1)","v":0},0,{"$f":"H14-SUM(I14:J14)","v":0},{"$f":"IFERROR(((K12+K14)/K12-1)-1,0)","v":0},{"$f":"K14-K12","v":0}]
[null,null,null,null,"Stop Loss",null,null,{"$f":"IF(B12=\"Venda\",IF(AND(F12=\"\",F15=\"\"),0,F12*G12),F15*G12)*IF(D12<>\"Ação\",IF(D12=\"Mini Dólar\",10,1/5),1)","v":0},{"$f":"IF(E12=E13,H15*IF(D12=\"Ação\",Auxiliar!$H$5,Auxiliar!$K$7/2)+IF(D12=\"Ação\",0,G12*Auxiliar!$N$8),H15*IF(D12=\"Ação\",Auxiliar!$H$4,Auxiliar!$K$6/2)+IF(D12=\"Ação\",0,G12*Auxiliar!$N$9))\n+IF(D12=\"Ação\",IF(H15>H12,IF(E12=E13,H15*Auxiliar!$J$4,Auxiliar!$J$5),0)\n+IF(Corretagem=\"Fixa\",IF(E12=E13,VLOOKUP(H15,Auxiliar!$M$4:$N$6,2,TRUE),Auxiliar!$N$7),VLOOKUP(H15,Auxiliar!$O$4:$R$8,4,TRUE)+VLOOKUP(H15,Auxiliar!$O$4:$R$8,3,TRUE)*H15)\n*(1+Auxiliar!$E$3+Auxiliar!$E$4),0)\n+IF(D12=\"Mini Índice\",G12*IF(E12=E13,Auxiliar!$N$8,Auxiliar!$N$10)*(1+Auxiliar!$E$3+Auxiliar!$E$4),0)\n/IF(D12=\"Mini Índice\",2,1)","v":0},0,0,{"$f":"IFERROR(((K12+K15)/K12-1)-1,0)","v":0},{"$f":"K15-K12","v":0}]

{"sheet":"PréCálculo","index":4,"n_rows":6,"n_cols":23,"rows_kept":6,"cut":false,"hidden":true,"merged":[[0,13,0,15],[0,1,1,1],[0,2,0,3],[0,4,1,4],[0,5,1,5],[0,6,1,6],[0,7,1,7],[0,8,1,8],[0,9,1,9],[0,10,1,10],[0,11,1,11],[0,12,1,12],[2,2,3,2],[2,3,3,3],[2,6,3,6],[2,12,3,12],[2,13,3,13],[0,16,0,18],[0,19,1,19],[0,20,1,20],[0,21,1,21],[0,22,1,22],[2,20,3,20],[2,21,3,21],[2,22,3,22],[2,14,3,14],[2,15,3,15],[2,16,3,16],[2,17,3,17],[2,18,3,18],[2,19,3,19]]}
[null,"Operação","Ativo",null,"Data","Cotação","Quantidade","Subtotal","Custos e Taxas","Ajuste Manual","Total","Resultado","Ganho Mínimo","Stop Gain",null,null,"Stop Loss",null,null,"Motivo Entrada","Motivo Stop Gain","Motivo Stop Loss","Motivo Saìda"]
[null,null,"Código","Tipo",null,null,null,null,null,null,null,null,null,"Stop Gain %","Stop Gain Auto.","Stop Gain Man.","Stop Loss %","Stop Loss Auto.","Stop Loss Man."]
[null,"Compra",null,"Mini Índice",null,null,null,{"$f":"SUBTOTAL_A(H3)","v":0},{"$f":"CUSTOS_A(I3)","v":0},0,{"$f":"TOTAL_A(K3)","v":0},{"$f":"IFERROR(RESULTADO_A(L3),0)","v":0},{"$f":"IFERROR(GANHO_MÍNIMO(M3),0)","v":0},null,{"$f":"IFERROR(STOP_GAIN(O3),0)","v":0},null,null,{"$f":"IFERROR(STOP_LOSS(R3),0)","v":0}]
[null,{"$f":"IF(B3=\"Venda\",\"Compra\",IF(B3=\"Compra\",\"Venda\",\"\"))","v":"Venda"},null,null,null,null,null,{"$f":"SUBTOTAL_B(H4)","v":0},{"$f":"CUSTOS_B(I4)","v":0},0,{"$f":"TOTAL_B(K4)","v":0},{"$f":"RESULTADO_B(L4)","v":0}]
[null,null,null,null,"Stop Gain",null,null,{"$f":"IF(B3=\"Venda\",IF(AND(F3=\"\",F5=\"\"),0,F3*G3),F5*G3)*IF(D3<>\"Ação\",IF(D3=\"Mini Dólar\",10,1/5),1)","v":0},{"$f":"IF(E3=E4,H5*IF(D3=\"Ação\",Auxiliar!$H$5,Auxiliar!$K$7/2)+IF(D3=\"Ação\",0,G3*Auxiliar!$N$8),H5*IF(D3=\"Ação\",Auxiliar!$H$4,Auxiliar!$K$6/2)+IF(D3=\"Ação\",0,G3*Auxiliar!$N$9))\n+IF(D3=\"Ação\",IF(H5>H3,IF(E3=E4,H5*Auxiliar!$J$4,Auxiliar!$J$5),0)\n+IF(Corretagem=\"Fixa\",IF(E3=E4,VLOOKUP(H5,Auxiliar!$M$4:$N$6,2,TRUE),Auxiliar!$N$7),VLOOKUP(H5,Auxiliar!$O$4:$R$8,4,TRUE)+VLOOKUP(H5,Auxiliar!$O$4:$R$8,3,TRUE)*H5)\n*(1+Auxiliar!$E$3+Auxiliar!$E$4),0)\n+IF(D3=\"Mini Índice\",G3*IF(E3=E4,Auxiliar!$N$8,Auxiliar!$N$10)*(1+Auxiliar!$E$3+Auxiliar!$E$4),0)\n/IF(D3=\"Mini Índice\",2,1)","v":0},0,{"$f":"H5-SUM(I5:J5)","v":0},{"$f":"IFERROR(((K3+K5)/K3-1)-1,0)","v":0},{"$f":"K5-K3","v":0}]
[null,null,null,null,"Stop Loss",null,null,{"$f":"IF(B3=\"Venda\",IF(AND(F3=\"\",F6=\"\"),0,F3*G3),F6*G3)*IF(D3<>\"Ação\",IF(D3=\"Mini Dólar\",10,1/5),1)","v":0},{"$f":"IF(E3=E4,H6*IF(D3=\"Ação\",Auxiliar!$H$5,Auxiliar!$K$7/2)+IF(D3=\"Ação\",0,G3*Auxiliar!$N$8),H6*IF(D3=\"Ação\",Auxiliar!$H$4,Auxiliar!$K$6/2)+IF(D3=\"Ação\",0,G3*Auxiliar!$N$9))\n+IF(D3=\"Ação\",IF(H6>H3,IF(E3=E4,H6*Auxiliar!$J$4,Auxiliar!$J$5),0)\n+IF(Corretagem=\"Fixa\",IF(E3=E4,VLOOKUP(H6,Auxiliar!$M$4:$N$6,2,TRUE),Auxiliar!$N$7),VLOOKUP(H6,Auxiliar!$O$4:$R$8,4,TRUE)+VLOOKUP(H6,Auxiliar!$O$4:$R$8,3,TRUE)*H6)\n*(1+Auxiliar!$E$3+Auxiliar!$E$4),0)\n+IF(D3=\"Mini Índice\",G3*IF(E3=E4,Auxiliar!$N$8,Auxiliar!$N$10)*(1+Auxiliar!$E$3+Auxiliar!$E$4),0)\n/IF(D3=\"Mini Índice\",2,1)","v":0},0,0,{"$f":"IFERROR(((K3+K6)/K3-1)-1,0)","v":0},{"$f":"K6-K3","v":0}]

{"sheet":"Sobre Função Excel","index":5,"n_rows":19,"n_cols":3,"rows_kept":19,"cut":false,"hidden":true,"merged":[[13,2,16,15]]}
[]
[]
[]
[]
[]
[]
[null,null,"Controle de Operações BM&F Bovespa "]
[null,null,"Versão 1.1 - Versão Demonstrativa"]
[]
[null,null,"O que é o Função Excel?"]
[null,null,"O Função Excel é um site de conteúdo gratuíto sobre a mais utilizada ferramenta de análise e controle de dados do mundo, o Microsoft Excel.\n"]
[]
[null,null,"O que o Função Excel tem a oferecer?"]
[null,null,"Além do conteúdo disponibilizado no site www.funcaoexcel.com.br e nas redes sociais, o Função Excel também elabora planilhas e sistemas em Excel sob encomenda para os mais variados fins. Entre alguns deles estão: controle de fluxo para empresas, controle de estoque, controle gerencial de tomada de decisão, sistema analítico para escritórios de contabilidade, sistema de vendas para lojistas."]
[]
[]
[]
[null,null,"Como posso entrar em contato?"]
[null,null,"Você pode entrar em contato direto com o Função Excel através do e-mail funcaoexcel@gmail.com ou pelos links à esquerda."]

{"sheet":"Auxiliar","index":6,"n_rows":34,"n_cols":21,"rows_kept":34,"cut":false,"hidden":true,"merged":[[0,19,0,21],[0,0,0,1],[1,5,1,10],[1,11,1,13],[1,14,1,17],[0,3,0,17],[1,3,1,4]]}
["Configurações Básicas",null,null,"Taxas",null,null,null,null,null,null,null,null,null,null,null,null,null,null,null,"Listas"]
["Ganho %",7.0000000000000001E-3,null,"Outras Taxas",null,"Emolumentos e Liquidação",null,null,null,null,null,"Corretagem",null,null,"Tabela de Corretagem BOVESPA",null,null,null,null,"Compra","Ação"]
["Perda %",3.0000000000000001E-3,null,"ISS SP",9.64E-2,"Mercado","Negociação","Liquidação","Registro","IRRF","Total","Tipo","Valor da Ordem","Valor Corretagem","Valor Inicial","Valor Final","Corretagem","Acréscimo",null,"Venda","Mini Dólar"]
["Operação Padrão","SwingTrade",null,"Outros Bovespa",3.9E-2,"À Vista",0,2.7500000000000002E-4,0,5.0000000000000002E-5,{"$f":"SUM(H4:J4)","v":3.2500000000000004E-4},"Day-Trade",0,8,1,135.07,0,2.7,null,null,"Mini Índice"]
["Corretagem","Fixa",null,null,null,"Day-trade",0,2.0000000000000001E-4,0,0.01,1.0200000000000001E-2,"Day-Trade",10000,10,135.08000000000001,498.62,2.0000000000000001E-4,0]
["Tipo de Ativo","Ação",null,null,null,"Mini à vista",8.7000000000000001E-5,1.7E-5,7.6000000000000004E-5,0,9.3000000000000011E-5,"Day-Trade",25000,12,498.63,1514.69,1.4999999999999999E-4,2.4900000000000002]
[null,null,null,null,null,"Mini Day-trade",6.0999999999999999E-5,1.7E-5,1.5E-5,0,3.1999999999999999E-5,"Normal",0,18.899999999999999,1514.7,3029.38,1E-4,10.06]
[null,null,null,null,null,null,null,null,null,null,null,"Mini Day-trade",0,1,3029.39,99999.99,5.0000000000000002E-5,25.21]
[null,null,null,null,null,null,null,null,null,null,null,"Mini Normal",0,2]
[]
[null,null,null,"Restrições do arquivo"]
[null,null,null,"Cálculo aproximado"]
[null,null,null,"Não possui cálculos para contratos cheios de dólar e índice"]
[null,null,null,"Não possui cálculos para commodities"]
[null,null,null,"Não possui cálculos para opções"]
[null,null,null,"Não possui cálculos para mercado a termo"]
[null,null,null,"Não leva em consideração IPOs"]
[null,null,null,"Não calcula custos com BTC"]
[]
[null,null,null,"Funcionalidades do arquivo"]
[null,null,null,"Estima resultado em operações de compra e venda de ações, mini dólar e mini índice, sejam elas day trade ou não"]
[null,null,null,"Calcula automaticamente os custos de cada operação realizada/simulada"]
[null,null,null,"Calcula automaticamente qual o ponto de saída cujo lucro é mínimo (ganho zero)"]
[null,null,null,"Calcula automaticamente qual o ponto de stop loss e stop gain de cada operação de acordo com % estipulado pelo trader"]
[null,null,null,"Informa ao trader uma estimativa do lucro/prejuizo real e percentual de cada operação a qualquer cotação"]
[null,null,null,"Disponibiliza campos para inserir os motivos de tomada de decisão do trader, para posteriomente análise"]
[null,null,null,"Gera relatórios que auxiliam o trader a identificar seus pontos fortes e fracos"]
[null,null,null,"Gera relatório comparativo entre os dias da semana, exibindo lucros, perdas e resultado médio"]
[null,null,null,"Gera relatório comparativo entre ativos operados, exibindo lucros, perdas e resultado médio"]
[null,null,null,"Gera relatório com percentual de trades positivos/negativos"]
[null,null,null,"Gera relatório com média de ganhos em trades positivos e média de perdas em trades negativos"]
[null,null,null,"Taxas e alíquotas de custos operacionais ajustáveis de acordo com a realidade do trader e sua corretora"]
[null,null,null,"Botões rápidos para incersão de novas operações, para evitar a perda de tempo longe do homebroker (Ideal para scalpers)"]
[null,null,null,"Cálculos 100% automatizados"]