{"text_format":"1","workbook":"xlsx","n_sheets":10,"sheets":["Início","Semana Atual","Ajuste","Gráficos","Configurações","Auxiliar","Log","Relatório","Banco de Dados","Função Excel"],"not_rendered":{"charts":30,"images":20,"macros":1,"external_links":0,"defined_names":1,"comments":0,"pivot_tables":0},"unopened":[],"bounds":{"document_bytes":16777216,"sheet_cells":100000,"rows_first":2000,"rows_last":500,"rows_between":2000,"halvings":0,"cell_chars":16384,"cell_head_chars":4096},"cells_cut":0,"cells_raw":0,"read":"whole","date_system":"1900"}

{"sheet":"Início","index":0,"n_rows":7,"n_cols":8,"rows_kept":7,"cut":false,"hidden":false,"merged":[]}
[]
[]
[]
[]
[]
[null,null,null,null,null,null,null,"1. APERTE NO BOTÃO HABILITAR EDIÇÃO"]
[null,null,null,null,null,null,null,"2. APERTE NO BOTÃO HABILITAR CONTEÚDO"]

{"sheet":"Semana Atual","index":1,"n_rows":281,"n_cols":11,"rows_kept":281,"cut":false,"hidden":false,"merged":[[33,2,33,8],[34,2,34,8],[35,2,35,8],[163,6,164,6],[163,7,164,7],[163,8,164,8],[163,9,164,9],[163,1,164,1],[163,2,164,2],[163,3,164,3],[163,4,164,4],[163,5,164,5],[212,8,213,8],[212,9,213,9],[247,7,248,7],[247,8,248,8],[247,9,248,9],[212,6,213,6],[212,7,213,7],[247,1,248,1],[247,2,248,2],[247,3,248,3],[247,4,248,4],[247,5,248,5],[247,6,248,6],[212,1,213,1],[212,2,213,2],[212,3,213,3],[212,4,213,4],[212,5,213,5],[114,1,115,1],[114,9,115,9],[114,2,115,2],[114,3,115,3],[114,4,115,4],[114,5,115,5],[114,6,115,6],[114,7,115,7],[114,8,115,8],[4,8,4,9],[5,1,6,1],[40,1,41,1],[40,9,41,9],[53,1,54,1],[53,9,54,9],[5,9,6,9],[9,2,9,8],[10,2,10,8],[13,2,13,8],[14,2,14,8],[20,2,20,8],[21,2,21,8],[24,2,24,8],[25,2,25,8],[32,2,32,8]]}
[]
[]
[]
[]
[null,null,null,null,null,null,null,null,{"$f":"'Função Excel'!$C$9","v":"Versão 2.1 - DEMO"}]
[null,"Ganhos, custos e despesas","Seg","Ter","Qua","Qui","Sex","Sáb","Dom","Total"]
[null,null,"2015-02-10",{"$f":"C7+1","v":"2015-02-11"},{"$f":"D7+1","v":"2015-02-12"},"2015-02-13","2015-02-14","2015-02-15","2015-02-16"]
[null,"Ganhos do dia",{"$f":"SUM(C9:C11)","v":0},{"$f":"SUM(D9:D11)","v":0},0,0,0,0,0,{"$f":"SUM(C8:I8)","v":0}]
[null,{"$f":"\"- \"&Configurações!$E$13","v":"- Uber"},null,null,null,null,null,null,null,{"$f":"SUM(C9:I9)","v":0},{"$f":"\"Ganhos do dia \"&B9","v":"Ganhos do dia - Uber"}]
[null,{"$f":"\"- \"&Configurações!$E$14","v":"- App 2"},"Não disponível para versão DEMO",null,null,null,null,null,null,0,{"$f":"\"Ganhos do dia \"&B10","v":"Ganhos do dia - App 2"}]
{"$rows_left_out":272}
{"sheet":"Ajuste","index":2,"n_rows":52,"n_cols":11,"rows_kept":52,"cut":false,"hidden":true,"merged":[[40,9,41,9],[4,8,4,9],[5,1,6,1],[5,9,6,9],[0,6,4,7],[9,2,9,8],[10,2,10,8],[13,2,13,8],[14,2,14,8],[20,2,20,8],[21,2,21,8],[24,2,24,8],[25,2,25,8],[32,2,32,8],[33,2,33,8],[34,2,34,8],[35,2,35,8],[40,1,41,1]]}
[null,null,null,null,null,null,"Edite os dados abaixo e clique em salvar para substituir no Banco de Dados"]
[]
[]
[]
[null,null,null,null,null,null,null,null,{"$f":"'Função Excel'!$C$9","v":"Versão 2.1 - DEMO"}]
[null,"Ganhos, gastos e custos","Seg","Ter","Qua","Qui","Sex","Sáb","Dom","Total"]
[null,null,"2013-12-31",{"$f":"C7+1","v":"2014-01-01"},{"$f":"D7+1","v":"2014-01-02"},"2014-01-03","2014-01-04","2014-01-05","2014-01-06"]
[null,"Ganhos do dia",{"$f":"SUM(C9:C11)","v":0},{"$f":"SUM(D9:D11)","v":0},0,0,0,0,0,{"$f":"SUM(C8:I8)","v":0}]
[null,{"$f":"\"- \"&Configurações!$E$13","v":"- Uber"},null,null,null,null,null,null,null,{"$f":"SUM(C9:I9)","v":0},"Ganhos do dia - Uber"]
[null,{"$f":"\"- \"&Configurações!$E$14","v":"- App 2"},"Não disponível para versão DEMO",null,null,null,null,null,null,0,"Ganhos do dia - Cabify"]
{"$rows_left_out":43}
{"sheet":"Gráficos","index":3,"n_rows":82,"n_cols":14,"rows_kept":82,"cut":false,"hidden":true,"merged":[[81,1,82,9],[5,8,7,9],[4,8,4,9],[6,6,7,6],[6,7,7,7],[60,1,61,9]]}
[]
[]
[]
[null,null,null,null,null,null,null,null,null,null,null,1,{"$f":"DATE(YEAR(TODAY()),MONTH(TODAY()),1)","v":"2015-01-31"},{"$f":"DATE(YEAR(TODAY()),MONTH(TODAY())+1,1)-1","v":"2015-02-27"}]
[null,null,null,null,null,null,null,null,{"$f":"'Função Excel'!$C$9","v":"Versão 2.1 - DEMO"},null,null,2,{"$f":"DATE(YEAR(TODAY()),MONTH(TODAY())-1,1)","v":"2014-12-31"},{"$f":"DATE(YEAR(TODAY()),MONTH(TODAY()),1)-1","v":"2015-01-30"}]
[null,null,null,null,null,null,"De","Até",{"$f":"IF(Auxiliar!$A$5=6,\"Digite o período de análise desejado\",\"\")","v":""},null,null,3,{"$f":"DATE(YEAR(TODAY()),1,1)","v":"2014-12-31"},{"$f":"DATE(YEAR(TODAY())+1,1,1)-1","v":"2015-12-30"}]
[null,"Período de Análise",null,null,null,null,"2014-10-31","2015-01-30",null,null,null,4,{"$f":"DATE(YEAR(TODAY()),MONTH(TODAY())-3,1)","v":"2014-10-31"},{"$f":"DATE(YEAR(TODAY()),MONTH(TODAY()),1)-1","v":"2015-01-30"}]
[null,null,null,null,null,null,null,null,null,null,null,5,{"$f":"MIN('Banco de Dados'!A:A)","v":"00:00:00"},{"$f":"TODAY()","v":"2015-02-09"}]
[]
[null,null,null,null,null,null,null,null,null,null,null,"Semana Passada",{"$f":"TODAY()-(5+WEEKDAY(TODAY()))","v":"2015-02-03"}]
{"$rows_left_out":73}
{"sheet":"Configurações","index":4,"n_rows":21,"n_cols":10,"rows_kept":21,"cut":false,"hidden":true,"merged":[[20,1,21,1],[16,4,16,8],[17,4,17,5],[18,4,18,5],[5,1,5,2],[4,9,4,10],[5,4,5,8],[11,4,11,8],[12,6,14,8],[12,4,12,5],[13,4,13,5],[14,4,14,5]]}
[]
[]
[]
[]
[null,null,null,null,null,null,null,null,null,{"$f":"'Função Excel'!$C$9","v":"Versão 2.1 - DEMO"}]
[null,"Veículo",null,null,"Configurações extras"]
[null,"Carro Próprio ou Alugado?","Carro próprio"]
[null,"Valor do aluguel",1500]
[null,"Consumo médio de combustível (km/Litro ou Km/m³)",13]
[null,"Preço médio do combustível (Litro ou m³)",4.3]
{"$rows_left_out":12}
{"sheet":"Auxiliar","index":5,"n_rows":52,"n_cols":9,"rows_kept":52,"cut":false,"hidden":true,"merged":[[7,0,7,8],[31,0,31,8]]}
[false,"Padrão de cores Branco",null,null,"Nº","Usuário","Computador","Processador","Contas Livres"]
[false,"Controle de Combustível",null,null,"#1","Rodrigo","DESKTOP-FJUD3LJ","Intel64 Family 6 Model 69 Stepping 1, GenuineIntel",{"$f":"COUNTA(F1:F4)+1","v":3}]
[false,"Aluguel Diário",null,null,"#2",null,null,null,"Liberado?"]
[true,"Importar versão anterior",null,null,"#3",null,null,null,true]
[4,"Periodo dos Gráficos",null,null,"Este","Rodrigo","DESKTOP-FJUD3LJ","Intel64 Family 6 Model 69 Stepping 1, GenuineIntel"]
[true,"Relatório colorido"]
[{"$f":"TODAY()-(5+WEEKDAY(TODAY()))","v":"2015-02-03"},"Hoje"]
["BASE PARA GRÁFICOS NA ABA SEMANA ATUAL"]
[null,{"$f":"IFERROR(C9-7,C9)","v":"Sem registro"},{"$f":"IFERROR(D9-7,D9)","v":"Sem registro"},{"$f":"IFERROR(E9-7,E9)","v":"Sem registro"},{"$f":"IFERROR(F9-7,F9)","v":"Sem registro"},{"$f":"IFERROR(G9-7,G9)","v":"Sem registro"},{"$f":"IFERROR(H9-7,H9)","v":"Sem registro"},"Sem registro",{"$f":"IF(MAX('Banco de Dados'!$A:$A)>0,MAX('Banco de Dados'!$A:$A),\"Sem registro\")","v":"Sem registro"}]
["Receita (Média Histórica)",{"$f":"'Semana Atual'!C$224","v":0},{"$f":"'Semana Atual'!D$224","v":0},{"$f":"'Semana Atual'!E$224","v":0},{"$f":"'Semana Atual'!F$224","v":0},{"$f":"'Semana Atual'!G$224","v":0},{"$f":"'Semana Atual'!H$224","v":0},{"$f":"'Semana Atual'!I$224","v":0}]
{"$rows_left_out":43}
{"sheet":"Log","index":6,"n_rows":66,"n_cols":4,"rows_kept":66,"cut":false,"hidden":true,"merged":[]}
["Data Hora","Usuário","Computador","Processador"]
["2015-02-09T12:32:11","Rodrigo","DESKTOP-FJUD3LJ","Intel64 Family 6 Model 69 Stepping 1, GenuineIntel"]
["2015-02-09T12:12:23","Rodrigo","DESKTOP-FJUD3LJ","Intel64 Family 6 Model 69 Stepping 1, GenuineIntel"]
["2015-02-09T12:08:01","Rodrigo","DESKTOP-FJUD3LJ","Intel64 Family 6 Model 69 Stepping 1, GenuineIntel"]
["2015-01-29T21:34:46","Rodrigo","DESKTOP-FJUD3LJ","Intel64 Family 6 Model 69 Stepping 1, GenuineIntel"]
["2015-01-29T21:30:25","Rodrigo","DESKTOP-FJUD3LJ","Intel64 Family 6 Model 69 Stepping 1, GenuineIntel"]
["2015-01-20T10:46:28","Rodrigo","DESKTOP-FJUD3LJ","Intel64 Family 6 Model 69 Stepping 1, GenuineIntel"]
["2015-01-15T18:47:49","Rodrigo","DESKTOP-FJUD3LJ","Intel64 Family 6 Model 69 Stepping 1, GenuineIntel"]
["2015-01-10T20:39:16","Rodrigo","DESKTOP-FJUD3LJ","Intel64 Family 6 Model 69 Stepping 1, GenuineIntel"]
["2014-12-27T16:41:56","Rodrigo","DESKTOP-FJUD3LJ","Intel64 Family 6 Model 69 Stepping 1, GenuineIntel"]
{"$rows_left_out":57}
{"sheet":"Relatório","index":7,"n_rows":40,"n_cols":9,"rows_kept":40,"cut":false,"hidden":true,"merged":[[4,8,4,9],[5,1,6,8],[7,1,7,8],[22,1,23,8]]}
[]
[]
[]
[]
[null,null,null,null,null,null,null,null,{"$f":"'Função Excel'!$C$9","v":"Versão 2.1 - DEMO"}]
[null,"Relatório de Controle para Motoristas"]
[]
[null,{"$f":"\"Relatório emitido em: \"&RIGHT(\"0\"&DAY($B$39),2)&\"/\"&RIGHT(\"0\"&MONTH($B$39),2)&\"/\"&RIGHT(\"0\"&YEAR($B$39),4)","v":"Relatório emitido em: 10/02/2019"}]
[null,"Período de análise","Mês Até Agora","Último Mês","Último 3 Meses","Últimos 6 Meses","Últimos 12 Meses","Acumulado Ano","Todo Período"]
[null,{"$f":"\"- \"&Configurações!E13","v":"- Uber"},{"$f":"SUMIFS('Banco de Dados'!$O:$O,'Banco de Dados'!$K:$K,\"Ganhos do Dia \"&$B10,'Banco de Dados'!$M:$M,\">=\"&Relatório!C$39,'Banco de Dados'!$N:$N,\"<=\"&DATE(YEAR(Relatório!C$39),MONTH(Relatório!C$39)+1,1)-1)+SUMIFS('Banco de Dados'!$O:$O,'Banco de Dados'!$K:$K,\"Bônus/Incentivo \"&$B10,'Banco de Dados'!$M:$M,\">=\"&Relatório!C$39,'Banco de Dados'!$N:$N,\"<=\"&DATE(YEAR(Relatório!C$39),MONTH(Relatório!C$39)+1,1)-1)+SUMIFS('Banco de Dados'!$R:$R,'Banco de Dados'!$K:$K,\"Ganhos do Dia \"&$B10,'Banco de Dados'!$P:$P,\">=\"&Relatório!C$39,'Banco de Dados'!$Q:$Q,\"<=\"&DATE(YEAR(Relatório!C$39),MONTH(Relatório!C$39)+1,1)-1)+SUMIFS('Banco de Dados'!$R:$R,'Banco de Dados'!$K:$K,\"Bônus/Incentivo \"&$B10,'Banco de Dados'!$P:$P,\">=\"&Relatório!C$39,'Banco de Dados'!$Q:$Q,\"<=\"&DATE(YEAR(Relatório!C$39),MONTH(Relatório!C$39)+1,1)-1)","v":0},{"$f":"SUMIFS('Banco de Dados'!$O:$O,'Banco de Dados'!$K:$K,\"Ganhos do Dia \"&$B10,'Banco de Dados'!$M:$M,\">=\"&Relatório!D$39,'Banco de Dados'!$N:$N,\"<=\"&DATE(YEAR(Relatório!D$39),MONTH(Relatório!D$39)+1,1)-1)+SUMIFS('Banco de Dados'!$O:$O,'Banco de Dados'!$K:$K,\"Bônus/Incentivo \"&$B10,'Banco de Dados'!$M:$M,\">=\"&Relatório!D$39,'Banco de Dados'!$N:$N,\"<=\"&DATE(YEAR(Relatório!D$39),MONTH(Relatório!D$39)+1,1)-1)+SUMIFS('Banco de Dados'!$R:$R,'Banco de Dados'!$K:$K,\"Ganhos do Dia \"&$B10,'Banco de Dados'!$P:$P,\">=\"&Relatório!D$39,'Banco de Dados'!$Q:$Q,\"<=\"&DATE(YEAR(Relatório!D$39),MONTH(Relatório!D$39)+1,1)-1)+SUMIFS('Banco de Dados'!$R:$R,'Banco de Dados'!$K:$K,\"Bônus/Incentivo \"&$B10,'Banco de Dados'!$P:$P,\">=\"&Relatório!D$39,'Banco de Dados'!$Q:$Q,\"<=\"&DATE(YEAR(Relatório!D$39),MONTH(Relatório!D$39)+1,1)-1)","v":0},{"$f":"SUMIFS('Banco de Dados'!$O:$O,'Banco de Dados'!$K:$K,\"Ganhos do Dia \"&$B10,'Banco de Dados'!$M:$M,\">=\"&Relatório!E$39,'Banco de Dados'!$N:$N,\"<=\"&DATE(YEAR(Relatório!$D$39),MONTH(Relatório!$D$39)+1,1)-1)+SUMIFS('Banco de Dados'!$O:$O,'Banco de Dados'!$K:$K,\"Bônus/Incentivo \"&$B10,'Banco de Dados'!$A:$A,\">=\"&Relatório!E$39,'Banco de Dados'!$A:$A,\"<=\"&DATE(YEAR(Relatório!$D$39),MONTH(Relatório!$D$39)+1,1)-1)+SUMIFS('Banco de Dados'!$R:$R,'Banco de Dados'!$K:$K,\"Ganhos do Dia \"&$B10,'Banco de Dados'!$P:$P,\">=\"&Relatório!E$39,'Banco de Dados'!$Q:$Q,\"<=\"&DATE(YEAR(Relatório!$D$39),MONTH(Relatório!$D$39)+1,1)-1)+SUMIFS('Banco de Dados'!$R:$R,'Banco de Dados'!$K:$K,\"Bônus/Incentivo \"&$B10,'Banco de Dados'!$A:$A,\">=\"&Relatório!E$39,'Banco de Dados'!$A:$A,\"<=\"&DATE(YEAR(Relatório!$D$39),MONTH(Relatório!$D$39)+1,1)-1)","v":0},{"$f":"SUMIFS('Banco de Dados'!$O:$O,'Banco de Dados'!$K:$K,\"Ganhos do Dia \"&$B10,'Banco de Dados'!$M:$M,\">=\"&Relatório!F$39,'Banco de Dados'!$N:$N,\"<=\"&DATE(YEAR(Relatório!$D$39),MONTH(Relatório!$D$39)+1,1)-1)+SUMIFS('Banco de Dados'!$O:$O,'Banco de Dados'!$K:$K,\"Bônus/Incentivo \"&$B10,'Banco de Dados'!$A:$A,\">=\"&Relatório!F$39,'Banco de Dados'!$A:$A,\"<=\"&DATE(YEAR(Relatório!$D$39),MONTH(Relatório!$D$39)+1,1)-1)+SUMIFS('Banco de Dados'!$R:$R,'Banco de Dados'!$K:$K,\"Ganhos do Dia \"&$B10,'Banco de Dados'!$P:$P,\">=\"&Relatório!F$39,'Banco de Dados'!$Q:$Q,\"<=\"&DATE(YEAR(Relatório!$D$39),MONTH(Relatório!$D$39)+1,1)-1)+SUMIFS('Banco de Dados'!$R:$R,'Banco de Dados'!$K:$K,\"Bônus/Incentivo \"&$B10,'Banco de Dados'!$A:$A,\">=\"&Relatório!F$39,'Banco de Dados'!$A:$A,\"<=\"&DATE(YEAR(Relatório!$D$39),MONTH(Relatório!$D$39)+1,1)-1)","v":0},{"$f":"SUMIFS('Banco de Dados'!$O:$O,'Banco de Dados'!$K:$K,\"Ganhos do Dia \"&$B10,'Banco de Dados'!$M:$M,\">=\"&Relatório!G$39,'Banco de Dados'!$N:$N,\"<=\"&DATE(YEAR(Relatório!$D$39),MONTH(Relatório!$D$39)+1,1)-1)+SUMIFS('Banco de Dados'!$O:$O,'Banco de Dados'!$K:$K,\"Bônus/Incentivo \"&$B10,'Banco de Dados'!$A:$A,\">=\"&Relatório!G$39,'Banco de Dados'!$A:$A,\"<=\"&DATE(YEAR(Relatório!$D$39),MONTH(Relatório!$D$39)+1,1)-1)+SUMIFS('Banco de Dados'!$R:$R,'Banco de Dados'!$K:$K,\"Ganhos do Dia \"&$B10,'Banco de Dados'!$P:$P,\">=\"&Relatório!G$39,'Banco de Dados'!$Q:$Q,\"<=\"&DATE(YEAR(Relatório!$D$39),MONTH(Relatório!$D$39)+1,1)-1)+SUMIFS('Banco de Dados'!$R:$R,'Banco de Dados'!$K:$K,\"Bônus/Incentivo \"&$B10,'Banco de Dados'!$A:$A,\">=\"&Relatório!G$39,'Banco de Dados'!$A:$A,\"<=\"&DATE(YEAR(Relatório!$D$39),MONTH(Relatório!$D$39)+1,1)-1)","v":0},{"$f":"SUMIFS('Banco de Dados'!$O:$O,'Banco de Dados'!$K:$K,\"Ganhos do Dia \"&$B10,'Banco de Dados'!$M:$M,\">=\"&Relatório!H$39,'Banco de Dados'!$N:$N,\"<=\"&DATE(YEAR(Relatório!$B$40),MONTH(Relatório!$B$40)+1,1)-1)+SUMIFS('Banco de Dados'!$O:$O,'Banco de Dados'!$K:$K,\"Bônus/Incentivo \"&$B10,'Banco de Dados'!$A:$A,\">=\"&Relatório!H$39,'Banco de Dados'!$A:$A,\"<=\"&DATE(YEAR(Relatório!$B$40),MONTH(Relatório!$B$40)+1,1)-1)+SUMIFS('Banco de Dados'!$R:$R,'Banco de Dados'!$K:$K,\"Ganhos do Dia \"&$B10,'Banco de Dados'!$P:$P,\">=\"&Relatório!H$39,'Banco de Dados'!$Q:$Q,\"<=\"&DATE(YEAR(Relatório!$B$40),MONTH(Relatório!$B$40)+1,1)-1)+SUMIFS('Banco de Dados'!$R:$R,'Banco de Dados'!$K:$K,\"Bônus/Incentivo \"&$B10,'Banco de Dados'!$A:$A,\">=\"&Relatório!H$39,'Banco de Dados'!$A:$A,\"<=\"&DATE(YEAR(Relatório!$B$40),MONTH(Relatório!$B$40)+1,1)-1)","v":0},{"$f":"SUMIFS('Banco de Dados'!J:J,'Banco de Dados'!K:K,\"Ganhos do Dia \"&$B10)+SUMIFS('Banco de Dados'!J:J,'Banco de Dados'!K:K,\"Bônus/Incentivo \"&$B10)","v":0}]
{"$rows_left_out":31}
{"sheet":"Banco de Dados","index":8,"n_rows":6,"n_cols":18,"rows_kept":6,"cut":false,"hidden":true,"merged":[[4,7,4,8]]}
["AAA","AAA","AAA"]
["AAA","AAA","AAA",null,null,null,null,null,null,{"$f":"MATCH(Ajuste!C7,'Banco de Dados'!A:A,0)","v":{"$error":"#N/A"}}]
["AAA","AAA","AAA",null,null,null,null,null,null,"2013-12-31"]
["AAA","AAA","AAA",null,null,null,null,null,null,{"$f":"MATCH(J3,A:A,0)","v":{"$error":"#N/A"}}]
["AAA","AAA","AAA",null,null,null,null,{"$f":"'Função Excel'!$C$9","v":"Versão 2.1 - DEMO"},null,{"$f":"MATCH('Semana Atual'!C7,'Banco de Dados'!A:A,0)","v":{"$error":"#N/A"}}]
["Semana do dia",{"$f":"COUNTIF(A:A,Auxiliar!$A$7)","v":0},"Seg","Ter","Qua","Qui","Sex","Sáb","Dom","Total",null,"Linha","De","Até","Total","De","Até","Total"]

{"sheet":"Função Excel","index":9,"n_rows":20,"n_cols":3,"rows_kept":20,"cut":false,"hidden":true,"merged":[[14,2,17,15]]}
[]
[]
[]
[]
[]
[]
[]
[null,null,"Planilha de Controle Uber, Cabify & 99 Pop"]
[null,null,"Versão 2.1 - DEMO"]
[]
{"$rows_left_out":10}