{"text_format":"1","workbook":"xlsx","n_sheets":8,"sheets":["Gerador de Catálogo","Textos Destacados","Sobre Função Excel","Produtos","Função Excel","Filtro","Catálogo","Controle"],"not_rendered":{"charts":0,"images":24,"macros":1,"external_links":1,"defined_names":8,"comments":0,"pivot_tables":0},"unopened":[],"bounds":{"document_bytes":16777216,"sheet_cells":100000,"rows_first":2000,"rows_last":500,"rows_between":2000,"halvings":0,"cell_chars":16384,"cell_head_chars":4096},"cells_cut":0,"cells_raw":0,"read":"whole","date_system":"1900"}

{"sheet":"Gerador de Catálogo","index":0,"n_rows":0,"n_cols":0,"rows_kept":0,"cut":false,"hidden":true,"merged":[]}

{"sheet":"Textos Destacados","index":1,"n_rows":6,"n_cols":13,"rows_kept":6,"cut":false,"hidden":true,"merged":[[4,3,4,5]]}
[]
[]
[]
[]
[null,"Na edição dos texto aperte ALT + ENTER para pular uma linha",null,"Exibir texto em"]
[null,"Texto a ser destacado","Título",{"$f":"Produtos!A6","v":"Setor"},{"$f":"Produtos!B6","v":"Sub-Categoria"},"Onde","Código","Existe?","Dinamico","Texto a ser destacado","Título","Onde","Dinamico"]

{"sheet":"Sobre Função Excel","index":2,"n_rows":19,"n_cols":3,"rows_kept":19,"cut":false,"hidden":true,"merged":[[13,2,16,15]]}
[]
[]
[]
[]
[]
[]
[null,null,"Gerador de Catálogos"]
[null,null,"Versão 3.1 DEMO"]
[]
[null,null,"O que é o Função Excel?"]
[null,null,"O Função Excel é um site de conteúdo gratuíto sobre a mais utilizada ferramenta de análise e controle de dados do mundo, o Microsoft Excel.\n"]
[]
[null,null,"O que o Função Excel tem a oferecer?"]
[null,null,"Além do conteúdo disponibilizado no site www.funcaoexcel.com.br e nas redes sociais, o Função Excel também elabora planilhas e sistemas em Excel sob encomenda para os mais variados fins. Entre alguns deles estão: controle de fluxo para empresas, controle de estoque, controle gerencial de tomada de decisão, sistema analítico para escritórios de contabilidade, sistema de vendas para lojistas."]
[]
[]
[]
[null,null,"Como posso entrar em contato?"]
[null,null,"Você pode entrar em contato direto com o Função Excel através do e-mail funcaoexcel@gmail.com ou pelos links à esquerda."]

{"sheet":"Produtos","index":3,"n_rows":6,"n_cols":7,"rows_kept":6,"cut":false,"hidden":true,"merged":[]}
[null,null,null,null,null,null,false]
[null,null,null,null,null,null,true]
[]
[]
["Coluna A","Coluna B","Coluna C","Coluna D","Coluna E","Coluna F","Coluna G"]
["Setor","Sub-Categoria","Produto","Preço","Ref.","Tamanho","Cor"]

{"sheet":"Função Excel","index":4,"n_rows":0,"n_cols":0,"rows_kept":0,"cut":false,"hidden":false,"merged":[]}

{"sheet":"Filtro","index":5,"n_rows":0,"n_cols":0,"rows_kept":0,"cut":false,"hidden":true,"merged":[]}

{"sheet":"Catálogo","index":6,"n_rows":0,"n_cols":0,"rows_kept":0,"cut":false,"hidden":true,"merged":[]}

{"sheet":"Controle","index":7,"n_rows":35,"n_cols":26,"rows_kept":35,"cut":false,"hidden":true,"merged":[[0,16,0,17]]}
["Todas",{"$f":"\"Controle!A1:A\"&COUNTA(A:A)","v":"Controle!A1:A1"},"Todas",{"$f":"\"Controle!C1:C\"&COUNTA(C:C)","v":"Controle!C1:C1"},null,null,null,{"$f":"\"Controle!G1:G\"&COUNTA(G:G)","v":"Controle!G1:G0"},null,"Cabeçalho Esq.",null,null,"Final","Critério 0",null,null,"BACKUP",null,null,"Posição de textos"]
[null,1,null,1,null,null,null,1,null,"Cabeçalho Centro",null,null,"Masculino","Critério 1",null,null,"Cabeçalho Esq.",null,null,"Esquerda",-4131,null,null,"3x2"]
[null,null,null,null,null,null,null,{"$f":"COUNTA(E:E)","v":0},null,"Cabeçalho Dir.",null,null,"Camisetas","Critério 2",null,null,"Cabeçalho Centro",null,null,"Centro",-4108,null,null,"B4","E4","H4"]
[null,null,null,null,null,null,null,null,null,"Rodapé Esq.",null,null,{"$f":"COUNTIFS('Textos Destacados'!D:D,Controle!M2,'Textos Destacados'!F:F,M1)","v":0},"Fórmula A",null,null,"Cabeçalho Dir.",null,null,"Direita",-4152,null,null,"B26","E26","H26"]
[null,null,null,null,null,null,null,null,null,"Rodapé Centro",null,null,{"$f":"COUNTIFS('Textos Destacados'!D:D,Controle!M2,'Textos Destacados'!E:E,Controle!M3,'Textos Destacados'!F:F,M1)","v":0},"Fórmula A + B",null,null,"Rodapé Esq.",null,null,"Justificado",-4130]
[null,null,null,null,null,null,null,null,null,"Rodapé Dir.",null,null,{"$f":"MATCH(M2&M1,'Textos Destacados'!D1:D8&'Textos Destacados'!F1:F8,0)","v":{"$error":"#N/A"}},"Linha critério A",null,null,"Rodapé Centro",null,null,null,null,null,null,"3x3"]
[null,null,null,null,null,null,null,null,null,"Logo C-Esquerda",0,null,{"$f":"MATCH(M2&M3&M1,'Textos Destacados'!D1:D8&'Textos Destacados'!E1:E8&'Textos Destacados'!F1:F8,0)","v":{"$error":"#N/A"}},"Linha de critérios A + B",null,null,"Rodapé Dir.",null,null,null,null,null,null,"B4","E4","H4"]
[null,null,null,null,null,null,null,null,null,"Logo C-Centro",1,null,3,"Fonte",null,null,"Logo C-Esquerda",0,null,null,null,null,null,"B19","E19","H19"]
[null,null,null,null,null,null,null,null,null,"Logo C-Direita",0,null,{"$f":"\"Controle!A2:A\"&COUNTA(A:A)","v":"Controle!A2:A1"},null,null,null,"Logo C-Centro",1,null,null,null,null,null,"B34","E34","H34"]
[null,null,null,null,null,null,null,null,null,"Logo R-Esquerda",0,null,{"$f":"\"Controle!C2:C\"&COUNTA(C:C)","v":"Controle!C2:C1"},null,null,null,"Logo C-Direita",0]
[null,null,null,null,null,null,null,null,null,"Logo R-Centro",2,null,null,null,null,null,"Logo R-Esquerda",0,null,null,null,null,null,"2x2"]
[null,null,null,null,null,null,null,null,null,"Logo R-Direita",0,null,null,null,null,null,"Logo R-Centro",2,null,null,null,null,null,"B4","F4"]
[null,null,null,null,null,null,null,null,null,"Cor Título",13799936,null,null,null,null,null,"Logo R-Direita",0,null,null,null,null,null,"B26","F26"]
[null,null,null,null,null,null,null,null,null,"Cor Linha",13799936,null,null,null,null,null,"Cor Título",13799936]
[null,null,null,null,null,null,null,null,null,"Cor Textos",6250335,null,null,null,null,null,"Cor Linha",13799936]
[null,null,null,null,null,null,null,null,null,"Moeda","Real",null,null,null,null,null,"Cor Textos",6250335]
[null,null,null,null,null,null,null,null,null,"Separação","Categoria",null,null,null,null,null,"Moeda","Real"]
[null,null,null,null,null,null,null,null,null,"Cor título destaque",13799936,null,null,null,null,null,"Separação","Categoria"]
[null,null,null,null,null,null,null,null,null,"Cor texto destaque",6250335,null,null,null,null,null,"Cor título destaque",13799936]
[null,null,null,null,null,null,null,null,null,"Tam. Título destaque",18,null,null,null,null,null,"Cor texto destaque",6250335]
[null,null,null,null,null,null,null,null,null,"Tam. Texto destaque",16,null,null,null,null,null,"Tam. Título destaque","18"]
[null,null,null,null,null,null,null,null,null,"Tam. Título de sessão",20,null,null,null,null,null,"Tam. Texto destaque","16"]
[null,null,null,null,null,null,null,null,null,"Tam. Textos em geral",11,null,null,null,null,null,"Tam. Título de sessão","20"]
[null,null,null,null,null,null,null,null,null,"Fonte Textos","Calibri",null,null,null,null,null,"Tam. Textos em geral",11]
[null,null,null,null,null,null,null,null,null,"Fonte Título de sessão","Segoe UI Semibold",null,null,null,null,null,"Fonte Textos","Calibri"]
[null,null,null,null,null,null,null,null,null,"Fonte Títulos destaque","Calibri",null,null,null,null,null,"Fonte Título de sessão","Segoe UI Semibold"]
[null,null,null,null,null,null,null,null,null,"Fonte Textos destaque","Calibri",null,null,null,null,null,"Fonte Títulos destaque","Calibri"]
[null,null,null,null,null,null,null,null,null,"Posição Nome produto","Centro",{"$f":"VLOOKUP(K28,$T$2:$U$5,2,FALSE)","v":-4108},null,null,null,null,"Fonte Textos destaque","Calibri"]
[null,null,null,null,null,null,null,null,null,"Posição Textos 1","Esquerda",-4131,null,null,null,null,"Posição Nome produto","Centro"]
[null,null,null,null,null,null,null,null,null,"Posição Textos 2","Direita",-4152,null,null,null,null,"Posição Textos 1","Esquerda"]
[null,null,null,null,null,null,null,null,null,"Posição Título de sessão","Centro",-4108,null,null,null,null,"Posição Textos 2","Direita"]
[null,null,null,null,null,null,null,null,null,"Posição Títulos destaque","Esquerda",-4131,null,null,null,null,"Posição Título de sessão","Centro"]
[null,null,null,null,null,null,null,null,null,"Posição Textos destaque","Esquerda",-4131,null,null,null,null,"Posição Títulos destaque","Esquerda"]
[null,null,null,null,null,null,null,null,null,"Módelo de catálogo",1,null,null,null,null,null,"Posição Textos destaque","Esquerda"]
[null,null,null,null,null,null,null,null,null,null,null,null,null,null,null,null,"Módelo de catálogo",1]